Peptide,PTM,ModifiedAA,ModifiedPosition,PeptideUniqueToGene,ExperimentDesc,ExpID,PubmedID,ScoreType,IdentScore,LocProb,Log2FChange,PQ-val,QuantSig,PEP,MassErrorPPM
SISDPSPLPPHTPRRPRPEYIPN,nt,S,59,true,"HUNTER N-terminome: legumain, GluC and trypsin",119,31951383,"MaxQuant score",71.8530000,,,,,,
SISDPSPLPPHTPRRPRPE,nt,S,59,true,"HUNTER N-terminome: legumain, GluC and trypsin",119,31951383,"MaxQuant score",77.2210000,,,,,,
SISDPSPLPPHTPR,nt,S,59,true,"Arg/N-end rule pathway Roots",80,25728785,"MASCOT Score",37.5300000,,,,,0.015530000440776,
SISDPSPLPPHTPR,nt,S,59,true,"N-terminal ChaFRADIC",92,26010716,"MASCOT Score",45.4700000,,,,,4.9939998802984E-9,
SISDPSPLPPHTPR,nt,S,59,true,"Stromal N-terminome",96,26371235,"MASCOT Score",45.2200000,,,,,,
SISDPSPLPPHTPR,nt,S,59,true,"Arg/N-end rule seed, prt6 vs. Wt",99,29168982,"MASCOT Score",45.2400000,,-0.2035938,0.0363031,NO,0.00036780000664294,-0.4573327
SISDPSPLPPHTPR,nt,S,59,true,"FtsH12 N-terminome: WT / FtsH12 knockdown miRNA",118,33216923,"MaxQuant score",96.1030000,,,,,4.8600000468468E-8,
SISDPSPLPPHTPR,nt,S,59,true,"HUNTER N-terminome: legumain, GluC and trypsin",119,31951383,"MaxQuant score",93.4940000,,,,,,
SISDPSPLPPHTPR,nt,S,59,true,"Arabidopsis translation initiation landscape - NT",167b,35069635,,,,,,,,
SISDPSPLPPHTPR,nta,S,59,true,"N-terminal ChaFRADIC",92,26010716,"MASCOT Score",23.7800000,,,,,0.024790000170469,
VFDTTLRDGEQSPGATLTSK,ph,S,102,true,"TOR Kinase and ABA Receptor",100,29290610,XCorr,4.3922682,1.0000000,,,,5.8499999511241E-8,
DGEQSPGATLTSK,ph,S,102,false,"Tissue atlas Arabidopsis - ProteomicsDB",114,32188942,"MaxQuant score",234.9300000,1.0000000,,,,0,
TIAETVGNTVDENGYVPVICGLSR,so,C,163,false,"S-sulfenylation site detection using YAP1C",110,32714340,,,,,,,,
KTKAEVIEIAR,nt,K,205,true,"Metacaspase9 substrates - in vitro rMC9",51c,23964026,"MASCOT Score",43.0000000,,1.4490684,,NO,,-0.5453783
SLGCEDVEFSPEDAGR,sno,C,226,false,"Site-specific nitrosomeproteomic id - gsnor1-3",90b,25699590,XCorr,3.4200000,,,,,0.00010199999815086,-6.7200000
SLGCEDVEFSPEDAGR,so,C,226,false,"S-sulfenylation site detection using YAP1C",110,32714340,,,,,,,,
DVEFSPEDAGR,nt,D,228,false,"Arg/N-end rule seed, prt6 vs. Wt",99,29168982,"MASCOT Score",39.7400000,,-0.2264308,0.1108225,NO,0.021509999409318,-2.1904313
ANTPGIENVVISTHCQNDLGLSTANTLSGAHAGAR,so,C,296,true,"Arabidopsis S-sulfenylation chemoproteomics",108,31578252,"pFind PSM Score",0.0411279,,,,,,0.6195227
QMEVTINGIGER,nt,Q,317,true,"HUNTER N-terminome: legumain, GluC and trypsin",119,31951383,"MaxQuant score",93.8390000,,,,,,
CRGDHVLGGLFTGIDTR,so,C,343,false,"S-sulfenylation site detection using YAP1C",110,32714340,,,,,,,,
AGNASLEEVVMAIKCR,so,C,343,false,"Arabidopsis S-sulfenylation chemoproteomics",108,31578252,"pFind PSM Score",0.0076474,,,,,,-2.0009595
SGIHQDGMLKHKGTYE,nt,S,392,false,"Arabidopsis translation initiation landscape - NT",167b,35069635,,,,,,,,
AIVGANAFAHESGIHQDGMLKHK,ac,K,401,false,"Histone deacetylases- hda14 vs WT (low light)",98c,29061669,"MaxQuant Score",215.7900000,1.0000000,3.5940000,0.1153453,NO,1.3999999803654E-27,
GTYEIICPEEIGLER,sno,C,410,true,"Site-specific nitrosomeproteomic id - gsnor1-3",90b,25699590,XCorr,2.7100000,,,,,0.053980000317097,-7.3000000
SNDAGIVLGKLSGR,nt,S,419,false,"Arabidopsis translation initiation landscape - NT",167b,35069635,,,,,,,,
EHVACSIGTGPVDSAYK,sno,C,520,true,"Site-specific nitrosomeproteomic id - gsnor1-3",90a,25699590,XCorr,3.3700000,,,,,0.055070001631975,-7.2500000
EHVACSIGTGPVDSAYK,sno,C,520,true,"Site-specific nitrosomeproteomic id - gsnor1-3",90b,25699590,XCorr,4.1900000,,,,,0.014050000347197,-6.0200000
EHVACSIGTGPVDSAYK,sno,C,520,true,"hot5-4 / wildtype, FAT-switch S-nitrosoproteome",169,37277371,,,,0.5467310,0.0044022,NO,,
EHVACSIGTGPVDSAYK,so,C,520,true,"S-sulfenylation site detection using YAP1C",110,32714340,,,,,,,,
