Peptide,PTM,ModifiedAA,ModifiedPosition,PeptideUniqueToGene,ExperimentDesc,ExpID,PubmedID,ScoreType,IdentScore,LocProb,Log2FChange,PQ-val,QuantSig,PEP,MassErrorPPM
TNSNSEDSKTESEKEK,ph,S,57,true,"Tissue atlas Arabidopsis - ProteomicsDB",114,32188942,"MaxQuant score",47.6880000,0.7787480,,,,0.0020316001027822,
TNSNSEDSKTESEKEK,ph,S,59,true,"SnRK2 protein kinase substrates",85,23776212,XCorr,3.4116926,0.9130000,,,,0.0021142798941582,
TNSNSEDSKTESEKEK,ph,S,59,true,"Tissue atlas Arabidopsis - ProteomicsDB",114,32188942,"MaxQuant score",101.7400000,0.7537050,,,,1.6700399783076E-6,
DHMEVLSPIK,ph,S,93,true,"srk2dei ABA signaling phopshoproteomics",83,23572148,"MASCOT Score",23.0000000,,,,,,0.0006000
DHMEVLSPIK,ph,S,93,true,"TOR Kinase and ABA Receptor",100,29290610,XCorr,3.3157594,1.0000000,,,,0.0014769999543205,
DHMEVLSPIK,ph,S,93,true,"Tissue atlas Arabidopsis - ProteomicsDB",114,32188942,"MaxQuant score",158.3400000,1.0000000,,,,7.286170102816E-7,
ATSLVVDCGGGSTTISPVHDGYVLQK,sno,C,179,true,"Site-specific nitrosomeproteomic id - gsnor1-3",90b,25699590,XCorr,3.6000000,,,,,1.4680000276712E-5,-6.7400000
ATSLVVDCGGGSTTISPVHDGYVLQK,so,C,179,true,"Arabidopsis S-sulfenylation chemoproteomics",108,31578252,"pFind PSM Score",0.2882710,,,,,,-0.3331759
AVVSSPLGGEFLTDCLLK,so,C,212,true,"S-sulfenylation site detection using YAP1C",110,32714340,,,,,,,,
CDVDIR,ox,C,348,false,"OxiTRAQ Arabidopsis - 5 mM H2O2 versus control",47,24376095,,,,-0.2564682,0.0913252,NO,,
CDVDIR,sno,C,348,false,"Cold stress nitrosylation - 4°C vs 22°C",65,24388526,,,,,,,,
CDVDIR,sno,C,348,false,"hot5-4 / wildtype, FAT-switch S-nitrosoproteome",169,37277371,,,,,,,,
DLIEESPHSAR,ph,S,387,true,"Tissue atlas Arabidopsis - ProteomicsDB",114,32188942,"MaxQuant score",93.6490000,0.9126990,,,,0.0002062260027742,
