Peptide,PTM,ModifiedAA,ModifiedPosition,PeptideUniqueToGene,ExperimentDesc,ExpID,PubmedID,ScoreType,IdentScore,LocProb,Log2FChange,PQ-val,QuantSig,PEP,MassErrorPPM
NSSALLPR,ph,S,295,true,"Tissue atlas Arabidopsis - ProteomicsDB",114,32188942,"MaxQuant score",98.6340000,0.9977640,,,,0.0053516901098192,
NISSDPSAKSFDIEK,ph,S,307,true,"Tissue atlas Arabidopsis - ProteomicsDB",114,32188942,"MaxQuant score",72.5830000,0.9970440,,,,0.00030573998810723,
NISSDPSAKSFDIEK,ph,S,310,true,"Tissue atlas Arabidopsis - ProteomicsDB",114,32188942,"MaxQuant score",72.5830000,0.9995010,,,,0.00030573998810723,
VADFGLSR,ph,S,484,false,"Tissue atlas Arabidopsis - ProteomicsDB",114,32188942,"MaxQuant score",107.8300000,1.0000000,,,,0.0038963700644672,
SGPLVAQSPDSVIVK,ph,S,630,true,"atm and atr DNA damage response",88,25561503,"MASCOT Score",38.0000000,1.0000000,,,,,-0.5900000
SGPLVAQSPDSVIVK,ph,S,630,true,"TOR Kinase and ABA Receptor",100,29290610,XCorr,3.9955645,1.0000000,,,,0.00077059998875484,
SGPLVAQSPDSVIVK,ph,S,630,true,"Tissue atlas Arabidopsis - ProteomicsDB",114,32188942,"MaxQuant score",209.1300000,1.0000000,,,,0,
SGPLVAQSPDSVIVK,ph,S,637,true,"atm and atr DNA damage response",88,25561503,"MASCOT Score",37.0000000,0.9970000,,,,,0.2100000
SGPLVAQSPDSVIVK,ph,S,637,true,"TOR Kinase and ABA Receptor",100,29290610,XCorr,3.9955645,0.9869000,,,,0.00077059998875484,
SGPLVAQSPDSVIVK,ph,S,637,true,"Tissue atlas Arabidopsis - ProteomicsDB",114,32188942,"MaxQuant score",193.1900000,0.9942600,,,,2.8913299347615E-34,
SGPLVAQSPDSVIVK,ph,S,640,true,"Lateral root-induction - NAA vs control",106,23328941,"MASCOT Score",24.0000000,,,,,,
