Peptide,PTM,ModifiedAA,ModifiedPosition,PeptideUniqueToGene,ExperimentDesc,ExpID,PubmedID,ScoreType,IdentScore,LocProb,Log2FChange,PQ-val,QuantSig,PEP,MassErrorPPM
ASANPETAKPTPA,nt,A,2,true,"Arg/N-end rule seed, prt6 vs. Wt",99,29168982,"MASCOT Score",31.6500000,,,,,0.050530001521111,-7.9614025
ASANPETAKPTPATVDMANPEELK,nta,A,2,true,"Characterization plant N-terminal acetylation",6,22223895,"MASCOT Score",52.0500000,,,,,,
ASANPETAKPTPATV,nta,A,2,true,"Arabidopsis translation initiation landscape - NTA",167a,35069635,,,,,,,,
ASANPETAKPTPA,nta,A,2,true,"Arg/N-end rule seed, prt6 vs. Wt",99,29168982,"MASCOT Score",31.6500000,,-0.1930657,0.2819900,NO,0.050530001521111,-7.9614025
ASANPETAKPTPATVDMANPEELK,ph,S,3,true,"Lateral root-induction - NAA vs control",106,23328941,"MASCOT Score",23.0000000,,,,,,
ASANPETAKPTPATVDMANPEELKK,ac,K,10,true,"Histone deacetylases- hda14 vs WT (low light)",98c,29061669,"MaxQuant Score",117.5300000,1.0000000,-0.1840000,0.9885531,NO,1.1000000216255E-10,
ASANPETAKPTPATVDMANPEELKK,ub,K,10,true,"upl3 mutant / wildtype",168,35926874,"MaxQuant score",53.4960000,1.0000000,0.8407653,,,6.0901798860868E-5,3.3732000
MASANPETAKPTPATVDMANPEELK,ph,T,12,true,"Large-scale phosphorylation discovery",44,23111157,XCorr,3.7370000,,,,,,
VFDQFDSNGDGK,ph,S,33,true,"Tissue atlas Arabidopsis - ProteomicsDB",114,32188942,"MaxQuant score",114.2100000,1.0000000,,,,5.0163300329586E-5,
AMGTSYTETELNR,ph,T,53,true,"srk2dei ABA signaling phopshoproteomics",83,23572148,"MASCOT Score",49.0000000,,,,,,-0.0005000
AMGTSYTETELNR,ph,T,53,true,"atm and atr DNA damage response",88,25561503,"MASCOT Score",39.0000000,0.9930000,,,,,-0.8800000
AMGTSYTETELNR,ph,T,53,true,"Lateral root-induction - NAA vs control",106,23328941,"MASCOT Score",39.0000000,,1.4003851,0.0000000,YES,,
AMGTSYTETELNR,ph,S,54,true,"Phosphorylation Early Elicitor Signaling",23,17317660,,,,,,,,
AMGTSYTETELNR,ph,S,54,true,"Phosphorylation nuclei-enriched fractions",28,19245862,,,,,,,,
AMGTSYTETELNR,ph,S,54,true,"Large-scale phosphorylation discovery",44,23111157,XCorr,4.3550000,,,,,,
AMGTSYTETELNR,ph,S,54,true,"Tyrosine phosphorylation in Arabidopsis",59,18463617,"MASCOT Score",34.0000000,,,,,,0.3222422
AMGTSYTETELNR,ph,S,54,true,"BSK8 and BSL2 regulating sucrose-ph synthase",66,24924143,"MaxQuant Score",125.2800000,,,,,,-1.2038000
AMGTSYTETELNR,ph,S,54,true,"srk2dei ABA signaling phopshoproteomics",83,23572148,"MASCOT Score",87.0000000,,,,,,0.0002000
AMGTSYTETELNR,ph,S,54,true,"LAXIC - ABA stress",84a,23660473,XCorr,3.4500000,0.9340000,,,,0.014688500203192,
AMGTSYTETELNR,ph,S,54,true,"LAXIC - mannitol vs control",84b,23660473,XCorr,3.7500000,0.9960000,3.2647708,,NO,0.00047061100485735,
AMGTSYTETELNR,ph,S,54,true,"SnRK2 protein kinase substrates",85,23776212,XCorr,2.6799676,0.9340000,,,,0.032047100365162,
AMGTSYTETELNR,ph,S,54,true,"SIRK1 phosphorylation",86a,23820729,"MaxQuant Score",139.9300000,0.8720000,,,,0.0049999998882413,6.8870000
AMGTSYTETELNR,ph,S,54,true,"atm and atr DNA damage response",88,25561503,"MASCOT Score",70.0000000,0.8680000,,,,,1.4800000
AMGTSYTETELNR,ph,S,54,true,"TOR Kinase and ABA Receptor",100,29290610,XCorr,3.5246632,0.9048000,,,,0.0014309999532998,
AMGTSYTETELNR,ph,S,54,true,"Lateral root-induction - NAA vs control",106,23328941,"MASCOT Score",34.0000000,,,,,,
AMGTSYTETELNR,ph,S,54,true,"Phospho cell culture sucrose/TOR",109,30833711,,,0.9987180,,,,,
AMGTSYTETELNR,ph,S,54,true,"Tissue atlas Arabidopsis - ProteomicsDB",114,32188942,"MaxQuant score",212.5900000,0.9999840,,,,6.2018247044548E-40,
AMGTSYTETELNR,ph,T,56,true,"Tissue atlas Arabidopsis - ProteomicsDB",114,32188942,"MaxQuant score",92.6500000,0.8900570,,,,0.00028755600214936,
AMGTSYTETELNR,ph,T,58,true,"Tissue atlas Arabidopsis - ProteomicsDB",114,32188942,"MaxQuant score",74.9660000,0.9730070,,,,0.0039082998409867,
VLEEVDTDR,ph,T,69,true,"Tissue atlas Arabidopsis - ProteomicsDB",114,32188942,"MaxQuant score",123.6700000,1.0000000,,,,0.00063282297924161,
VLEEVDTDRDGYINLDEFSTLCR,ox,C,84,true,"SPEAR - 10 mM H2O2 / mock",138a,34619326,,,,-1.8397240,0.0431978,YES,,
SSSSAAEIRDAFDLYDQDK,ph,S,88,true,"srk2dei ABA signaling phopshoproteomics",83,23572148,"MASCOT Score",78.0000000,,,,,,0.0001000
SSSSAAEIRDAFDLYDQDK,ph,S,88,true,"Tissue atlas Arabidopsis - ProteomicsDB",114,32188942,"MaxQuant score",172.9500000,0.9967630,,,,0,
SSSSAAEIR,ph,S,88,true,"Chloroplast kinase substrates",60,19376835,"MASCOT Score",31.8200000,,,,,,1.1499300
SSSSAAEIR,ph,S,88,true,"LAXIC - mannitol vs control",84b,23660473,XCorr,2.5000000,0.9930000,,,,0.0013613100163639,
SSSSAAEIR,ph,S,88,true,"SnRK2 protein kinase substrates",85,23776212,XCorr,2.1215334,0.9720000,,,,0.06518729776144,
SSSSAAEIR,ph,S,88,true,"atm and atr DNA damage response",88,25561503,"MASCOT Score",54.0000000,0.9480000,,,,,-0.3100000
SSSSAAEIR,ph,S,88,true,"Phospho cell culture sucrose/TOR",109,30833711,,,0.8424440,,,,,
DAFDLYDQDKNGLISASELHQVLNR,ub,K,104,true,"Arabidopsis ubiquitination COFRADIC",40,26744219,"MaxQuant Score",41.4460000,1.0000000,,,,2.7940000535409E-8,1.5280000
LGMSCSVEDCTR,ph,S,125,true,"srk2dei ABA signaling phopshoproteomics",83,23572148,"MASCOT Score",32.0000000,,,,,,-0.0003000
LGMSCSVEDCTR,ph,S,125,true,"Tissue atlas Arabidopsis - ProteomicsDB",114,32188942,"MaxQuant score",108.6600000,0.9989980,,,,2.1519799702219E-5,
LGMSCSVEDCTR,acy,C,129,true,"Arabidopsis S-acylation atlas - Meristem",163a,35681017,,,,,,,,
LGMSCSVEDCTR,acy,C,129,true,"Arabidopsis S-acylation atlas - Hypocotyl",163b,35681017,,,,,,,,
