Peptide,PTM,ModifiedAA,ModifiedPosition,PeptideUniqueToGene,ExperimentDesc,ExpID,PubmedID,ScoreType,IdentScore,LocProb,Log2FChange,PQ-val,QuantSig,PEP,MassErrorPPM
IFGSPNR,ph,S,161,true,"srk2dei ABA signaling phopshoproteomics",83,23572148,"MASCOT Score",36.0000000,,,,,,0.0003000
IFGSPNR,ph,S,161,true,"TOR Kinase and ABA Receptor",100,29290610,XCorr,2.3944383,1.0000000,,,,0.0084039997309446,
KFTHQVFAR,ph,T,167,false,"srk2dei ABA signaling phopshoproteomics",83,23572148,"MASCOT Score",35.0000000,,,,,,0.0014000
KFTHQVFAR,ph,T,167,false,"atm and atr DNA damage response",88,25561503,"MASCOT Score",38.0000000,1.0000000,,,,,-0.3700000
KFTHQVFAR,ph,T,167,false,"TOR Kinase and ABA Receptor",100,29290610,XCorr,2.7444439,1.0000000,,,,0.016100000590086,
KFTHQVFAR,ph,T,167,false,"Tissue atlas Arabidopsis - ProteomicsDB",114,32188942,"MaxQuant score",117.2000000,1.0000000,,,,0.00012893200619146,
FTHQVFAR,ph,T,167,false,"Phospho cell culture sucrose/TOR",109,30833711,,,1.0000000,,,,,
HEAITVQSPPRK,ph,T,324,true,"Phospho cell culture sucrose/TOR",109,30833711,,,0.8098500,,,,,
HEAITVQSPPRK,ph,S,327,true,"srk2dei ABA signaling phopshoproteomics",83,23572148,"MASCOT Score",39.0000000,,,,,,-0.0004000
HEAITVQSPPRK,ph,S,327,true,"atm and atr DNA damage response",88,25561503,"MASCOT Score",40.0000000,1.0000000,,,,,0.0400000
HEAITVQSPPRK,ph,S,327,true,"Phospho cell culture sucrose/TOR",109,30833711,,,0.9999440,,,,,
HEAITVQSPPR,ph,S,327,true,"atm and atr DNA damage response",88,25561503,"MASCOT Score",38.0000000,1.0000000,,,,,-0.3600000
HEAITVQSPPR,ph,S,327,true,"Tissue atlas Arabidopsis - ProteomicsDB",114,32188942,"MaxQuant score",273.7400000,1.0000000,,,,0,
