Peptide,PTM,ModifiedAA,ModifiedPosition,PeptideUniqueToGene,ExperimentDesc,ExpID,PubmedID,ScoreType,IdentScore,LocProb,Log2FChange,PQ-val,QuantSig,PEP,MassErrorPPM
AALKTVEQTTLTEDNR,nt,A,50,true,"Arg/N-end rule pathway Roots",80,25728785,"MASCOT Score",33.3400000,,,,,0.0045719998888671,
AALKTVEQTTLTEDNR,nt,A,50,true,"HUNTER N-terminome: legumain, GluC and trypsin",119,31951383,"MaxQuant score",53.5650000,,,,,,
AALKTVEQTTLTEDNR,nta,A,50,true,"FtsH12 N-terminome: WT / FtsH12 knockdown miRNA",118,33216923,"MaxQuant score",71.6010000,,1.0681176,0.1321033,NO,0,
ALKTVEQTTLTEDNR,nt,A,51,true,"Arg/N-end rule pathway Roots",80,25728785,"MASCOT Score",44.8300000,,,,,1.152999993792E-5,
ALKTVEQTTLTEDNR,nt,A,51,true,"FtsH12 N-terminome: WT / FtsH12 knockdown miRNA",118,33216923,"MaxQuant score",174.3200000,,0.4650445,0.0434500,NO,0,
ALKTVEQTTLTEDNR,nt,A,51,true,"HUNTER N-terminome: legumain, GluC and trypsin",119,31951383,"MaxQuant score",109.0700000,,,,,,
ALKTVEQTTLTEDNR,nt,A,51,true,"Arabidopsis translation initiation landscape - NT",167b,35069635,,,,,,,,
ALKTVEQTTLTEDN,nt,A,51,true,"HUNTER N-terminome: legumain, GluC and trypsin",119,31951383,"MaxQuant score",177.1000000,,,,,,
ALKTVEQTTLTED,nt,A,51,true,"HUNTER N-terminome: legumain, GluC and trypsin",119,31951383,"MaxQuant score",112.1300000,,,,,,
FSTVGSDSDEYNPTLPKPR,ph,S,67,true,"Large-scale phosphorylation discovery",44,23111157,XCorr,3.6550000,,,,,,
FSTVGSDSDEYNPTLPKPR,ph,S,67,true,"Lateral root-induction - NAA vs control",106,23328941,"MASCOT Score",48.0000000,,,,,,
FSTVGSDSDEYNPTLPKPR,ph,T,68,true,"Phosphoproteome iron-deficient Arabidopsis roots",41,22438062,"MASCOT Score",59.2000000,,,,,,
FSTVGSDSDEYNPTLPKPR,ph,T,68,true,"SnRK2 protein kinase substrates",85,23776212,XCorr,4.7277102,0.8500000,,,,0.0055464101023972,
FSTVGSDSDEYNPTLPKPR,ph,T,68,true,"Lateral root-induction - NAA vs control",106,23328941,"MASCOT Score",38.0000000,,,,,,
TVEQTTLTEDNRFSTVGSDSDEYNPTLPKPR,ph,S,71,true,"PAMP-triggered phosphorylation",48,24601666,"MASCOT Score",44.2200000,,,,,,
FSTVGSDSDEYNPTLPKPR,ph,S,71,true,"Arabidopsis root NAA phosphoproteome",18a,27643528,"MaxQuant Score",71.6510000,0.9140000,,,,1.2409999783358E-7,0.1970000
FSTVGSDSDEYNPTLPKPR,ph,S,71,true,"Phosphorylation nuclei-enriched fractions",28,19245862,,,,,,,,
FSTVGSDSDEYNPTLPKPR,ph,S,71,true,"STN8 phosphoproteome",38,21768351,"MASCOT Score",48.0300000,,,,,,-0.9867350
FSTVGSDSDEYNPTLPKPR,ph,S,71,true,"Phosphoproteome iron-deficient Arabidopsis roots",41,22438062,"MASCOT Score",58.9800000,,,,,,
FSTVGSDSDEYNPTLPKPR,ph,S,71,true,"Large-scale phosphorylation discovery",44,23111157,XCorr,3.6550000,,,,,,
FSTVGSDSDEYNPTLPKPR,ph,S,71,true,"PAMP-triggered phosphorylation",48,24601666,"MASCOT Score",80.1200000,,,,,,
FSTVGSDSDEYNPTLPKPR,ph,S,71,true,"LAXIC - mannitol vs control",84b,23660473,XCorr,4.5300000,0.9970000,,,,6.4800001382537E-6,
FSTVGSDSDEYNPTLPKPR,ph,S,71,true,"Lateral root-induction - NAA vs control",106,23328941,"MASCOT Score",49.0000000,,,,,,
FSTVGSDSDEYNPTLPKPR,ph,S,71,true,"Phospho cell culture sucrose/TOR",109,30833711,,,0.9852130,,,,,
FSTVGSDSDEYNPTLPKPR,ph,S,71,true,"Col-0 callus - FC Col-0 vs. Col-0 Xray",111a,31410901,,64.1100000,,0.5516211,0.0000000,NO,,1.0343283
FSTVGSDSDEYNPTLPKPR,ph,S,71,true,"Col-0 X-ray callus - FC Col-0 vs. Col-0 Xray",111b,31410901,,64.1100000,,0.5516211,0.0000000,NO,,1.0343283
FSTVGSDSDEYNPTLPKPR,ph,S,71,true,"atm callus - FC atm vs. atm Xray",111c,31410901,,64.1100000,,0.9973569,0.0000000,NO,,1.0343283
FSTVGSDSDEYNPTLPKPR,ph,S,71,true,"atm-3 X-ray callus - FC atm vs. atm Xray",111d,31410901,,64.1100000,,0.9973569,0.0000000,NO,,1.0343283
FSTVGSDSDEYNPTLPKPR,ph,S,71,true,"Tissue atlas Arabidopsis - ProteomicsDB",114,32188942,"MaxQuant score",487.0700000,1.0000000,,,,0,
FSTVGSDSDEYNPTLPKPR,ph,S,71,true,"Touch-induced phosphorylation: 40s touch vs untouc",136,30291188,"MASCOT score",124.3800000,,0.0998204,0.5992916,NO,,1.9216562
FSTVGSDSDEYNPTLPK,ph,S,71,true,"BSK8 and BSL2 regulating sucrose-ph synthase",66,24924143,"MaxQuant Score",125.0300000,,,,,,0.3398500
FSTVGSDSDEYNPTLPK,ph,S,71,true,"atm and atr DNA damage response",88,25561503,"MASCOT Score",39.0000000,0.9870000,,,,,-0.0400000
FSTVGSDSDEYNPTLPKPR,ph,S,73,true,"Tyrosine phosphorylation in Arabidopsis",59,18463617,"MASCOT Score",41.0000000,,,,,,-1.2334596
FSTVGSDSDEYNPTLPKPR,ph,S,73,true,"Conserved plant phosphoproteome - Arabidopsis",61a,20466843,"MASCOT Score",41.0000000,1.0000000,,,,,
FSTVGSDSDEYNPTLPKPR,ph,S,73,true,"Lateral root-induction - NAA vs control",106,23328941,"MASCOT Score",25.0000000,,,,,,
FSTVGSDSDEYNPTLPKPR,ph,S,73,true,"Tissue atlas Arabidopsis - ProteomicsDB",114,32188942,"MaxQuant score",97.2710000,0.9644430,,,,5.1484101959431E-7,
FSTVGSDSDEYNPTLPKPR,ph,Y,76,true,"Lateral root-induction - NAA vs control",106,23328941,"MASCOT Score",20.0000000,,,,,,
GGVIDEDALVR,nt,G,313,false,"Arg/N-end rule pathway Roots",80,25728785,"MASCOT Score",29.2400000,,,,,0.0086730001494288,
