Peptide,PTM,ModifiedAA,ModifiedPosition,PeptideUniqueToGene,ExperimentDesc,ExpID,PubmedID,ScoreType,IdentScore,LocProb,Log2FChange,PQ-val,QuantSig,PEP,MassErrorPPM
MNGGDDAATSGPPPSLEWR,nta,M,1,true,"Characterization plant N-terminal acetylation",6,22223895,"MASCOT Score",56.7000000,,,,,,
MNGGDDAATSGPPPSLEWR,nta,M,1,true,"Arg/N-end rule pathway Roots",80,25728785,"MASCOT Score",83.8100000,,,,,4.1010000728647E-8,
MNGGDDAATSGPPPSLEWR,nta,M,1,true,"HUNTER N-terminome: legumain, GluC and trypsin",119,31951383,"MaxQuant score",132.0500000,,,,,,
MNGGDDAATSGPPPSLE,nta,M,1,true,"HUNTER N-terminome: legumain, GluC and trypsin",119,31951383,"MaxQuant score",95.0940000,,,,,,
KDLEQTDYPVR,ub,K,76,true,"upl3 mutant / wildtype",168,35926874,"MaxQuant score",102.8700000,1.0000000,0.4781953,0.4287000,NO,0.00013677899551112,-1.1021000
QSALCDSHTK,sno,C,307,true,"hot5-4 / wildtype, FAT-switch S-nitrosoproteome",169,37277371,,,,,,,,
LFEEPEAPGSR,ph,S,322,true,"Tissue atlas Arabidopsis - ProteomicsDB",114,32188942,"MaxQuant score",150.2100000,1.0000000,,,,1.7481099234828E-8,
LCDLYENDSIFDK,sno,C,379,false,"hot5-4 / wildtype, FAT-switch S-nitrosoproteome",169,37277371,,,,,,,,
LCDLYENDSIFDK,so,C,379,false,"S-sulfenylation site detection using YAP1C",110,32714340,,,,,,,,
LCDLYENDSIFDKFECCLSGDGLR,ub,K,390,true,"Arabidopsis ubiquitination by TUBEs",2,23667124,,,,,,,,
VATGSYSNLFR,ph,S,406,true,"Tissue atlas Arabidopsis - ProteomicsDB",114,32188942,"MaxQuant score",128.3600000,0.9009900,,,,8.0035197242978E-6,
QIQTPARPSR,ph,T,439,true,"Tissue atlas Arabidopsis - ProteomicsDB",114,32188942,"MaxQuant score",124.2100000,1.0000000,,,,0.00019623599655461,
QIQTPARPSR,ph,S,444,true,"Tissue atlas Arabidopsis - ProteomicsDB",114,32188942,"MaxQuant score",150.0900000,0.9999990,,,,1.5603600331815E-6,
SIGSMTR,ph,S,449,true,"Tissue atlas Arabidopsis - ProteomicsDB",114,32188942,"MaxQuant score",87.2580000,0.9942380,,,,0.0062512699514627,
RGSESPGTEANGNAYDFTTK,ph,S,458,true,"TOR Kinase and ABA Receptor",100,29290610,XCorr,5.5552530,0.8900000,,,,1.7850000644248E-10,
RGSESPGTEANGNAYDFTTK,ph,S,458,true,"Tissue atlas Arabidopsis - ProteomicsDB",114,32188942,"MaxQuant score",232.3500000,0.9995450,,,,0,
GSESPGTEANGNAYDFTTK,ph,S,458,true,"Lateral root-induction - NAA vs control",106,23328941,"MASCOT Score",21.0000000,,,,,,
RGSESPGTEANGNAYDFTTK,ph,S,460,true,"srk2dei ABA signaling phopshoproteomics",83,23572148,"MASCOT Score",75.0000000,,,,,,-0.0010000
RGSESPGTEANGNAYDFTTK,ph,S,460,true,"SnRK2 protein kinase substrates",85,23776212,XCorr,3.6793313,0.9950000,,,,2.8070999178453E-5,
RGSESPGTEANGNAYDFTTK,ph,S,460,true,"atm and atr DNA damage response",88,25561503,"MASCOT Score",84.0000000,0.9440000,,,,,-0.6500000
GSESPGTEANGNAYDFTTK,ph,S,460,true,"srk2dei ABA signaling phopshoproteomics",83,23572148,"MASCOT Score",73.0000000,,,,,,0.0007000
GSESPGTEANGNAYDFTTK,ph,S,460,true,"LAXIC - ABA stress",84a,23660473,XCorr,4.1400000,0.8340000,,,,7.9299999924842E-5,
GSESPGTEANGNAYDFTTK,ph,S,460,true,"LAXIC - mannitol vs control",84b,23660473,XCorr,4.0300000,0.8510000,,,,5.7699998023963E-7,
GSESPGTEANGNAYDFTTK,ph,S,460,true,"SnRK2 protein kinase substrates",85,23776212,XCorr,3.7523739,0.9280000,,,,2.0867300918326E-6,
GSESPGTEANGNAYDFTTK,ph,S,460,true,"atm and atr DNA damage response",88,25561503,"MASCOT Score",54.0000000,0.8920000,,,,,-0.5100000
GSESPGTEANGNAYDFTTK,ph,S,460,true,"TOR Kinase and ABA Receptor",100,29290610,XCorr,5.6828332,0.9879000,,,,8.2570004167337E-9,
GSESPGTEANGNAYDFTTK,ph,S,460,true,"Lateral root-induction - NAA vs control",106,23328941,"MASCOT Score",41.0000000,,,,,,
GSESPGTEANGNAYDFTTK,ph,S,460,true,"Col-0 callus - FC Col-0 vs. Col-0 Xray",111a,31410901,,83.5800000,,1.1290856,0.0152371,YES,,1.1465903
GSESPGTEANGNAYDFTTK,ph,S,460,true,"Col-0 X-ray callus - FC Col-0 vs. Col-0 Xray",111b,31410901,,83.5800000,,1.1290856,0.0152371,YES,,1.1465903
GSESPGTEANGNAYDFTTK,ph,S,460,true,"atm callus - FC atm vs. atm Xray",111c,31410901,,83.5800000,,0.6362920,0.1124109,NO,,1.1465903
GSESPGTEANGNAYDFTTK,ph,S,460,true,"atm-3 X-ray callus - FC atm vs. atm Xray",111d,31410901,,83.5800000,,0.6362920,0.1124109,NO,,1.1465903
GSESPGTEANGNAYDFTTK,ph,S,460,true,"Tissue atlas Arabidopsis - ProteomicsDB",114,32188942,"MaxQuant score",447.5100000,1.0000000,,,,0,
RGSESPGTEANGNAYDFTTK,ph,T,463,true,"srk2dei ABA signaling phopshoproteomics",83,23572148,"MASCOT Score",60.0000000,,,,,,0.0007000
RGSESPGTEANGNAYDFTTK,ph,T,463,true,"Col-0 callus - FC Col-0 vs. Col-0 Xray",111a,31410901,,40.9100000,,1.2224311,0.0480336,YES,,0.2263798
RGSESPGTEANGNAYDFTTK,ph,T,463,true,"Col-0 X-ray callus - FC Col-0 vs. Col-0 Xray",111b,31410901,,40.9100000,,1.2224311,0.0480336,YES,,0.2263798
RGSESPGTEANGNAYDFTTK,ph,T,463,true,"atm callus - FC atm vs. atm Xray",111c,31410901,,40.9100000,,0.5169688,0.2501548,NO,,0.2263798
RGSESPGTEANGNAYDFTTK,ph,T,463,true,"atm-3 X-ray callus - FC atm vs. atm Xray",111d,31410901,,40.9100000,,0.5169688,0.2501548,NO,,0.2263798
RGSESPGTEANGNAYDFTTK,ph,T,463,true,"Tissue atlas Arabidopsis - ProteomicsDB",114,32188942,"MaxQuant score",136.2400000,0.9840860,,,,5.8327698804929E-22,
