Peptide,PTM,ModifiedAA,ModifiedPosition,PeptideUniqueToGene,ExperimentDesc,ExpID,PubmedID,ScoreType,IdentScore,LocProb,Log2FChange,PQ-val,QuantSig,PEP,MassErrorPPM
TDDRVYPASKPPAIVGGGAPTTNPTFPANK,ub,K,11,true,"Ubiquitination Membrane Proteins",120,33585938,,,,,,,,
VYPASKPPAIVGGGAPTTNPTFPANK,ph,T,23,true,"Tissue atlas Arabidopsis - ProteomicsDB",114,32188942,"MaxQuant score",88.2420000,0.7689210,,,,1.8211199895638E-15,
VYPASKPPAIVGGGAPTTNPTFPANK,ph,T,26,true,"Tissue atlas Arabidopsis - ProteomicsDB",114,32188942,"MaxQuant score",57.5330000,0.9243730,,,,3.4629400033737E-5,
ISTLNFTSAVR,ng,N,105,true,"Conserved N-glycosylation",74,22633491,"MaxQuant Score",97.4720000,1.0000000,,,,0.00027660001069307,0.6570000
ISTLNFTSAVR,ng,N,105,true,"N-linked Glycan Micro-heterogeneity Arabidopsis",134,29237727,,,,,,,,
ISTLNFTSAVR,ng,N,105,true,"UDP-GlcNAc transporter glycopeptide analysis",135,30224661,,,,,,,4.2889384535214E-14,0.5000000
GTIAAFSHGKKNTTTLR,ng,N,167,true,"Conserved N-glycosylation",74,22633491,"MaxQuant Score",73.4370000,1.0000000,,,,0.0020000000949949,1.0330000
GTIAAFSHGKKNTTTLR,ng,N,167,true,"N-Glycopeptide Profiling in Arabidopsis Infloresce",132,27067053,"MOWSE score",24.6000000,,,,,0.0010999999940395,
VTCEGIKVVAPTGK,acy,C,228,true,"Arabidopsis S-acylation atlas - Silique",163e,35681017,,,,,,,,
SGIRVTCEGIK,acy,C,228,true,"Arabidopsis S-acylation atlas - Silique",163e,35681017,,,,,,,,
VTCEGIK,ox,C,228,true,"OxiTRAQ Arabidopsis - 5 mM H2O2 versus control",47,24376095,,,,-0.4002544,0.0096371,NO,,
VTCEGIK,sno,C,228,true,"hot5-4 / wildtype, FAT-switch S-nitrosoproteome",169,37277371,,,,,,,,
