Peptide,PTM,ModifiedAA,ModifiedPosition,PeptideUniqueToGene,ExperimentDesc,ExpID,PubmedID,ScoreType,IdentScore,LocProb,Log2FChange,PQ-val,QuantSig,PEP,MassErrorPPM
AAPVIIVGSH,nt,A,2,true,"Arg/N-end rule seed, prt6 vs. Wt",99,29168982,"MASCOT Score",49.0700000,,,,,0.16660000383854,-0.2475561
AAPVIIVGSH,nta,A,2,true,"Arg/N-end rule seed, prt6 vs. Wt",99,29168982,"MASCOT Score",49.0700000,,,,,0.16660000383854,-0.2475561
ISGAAIRTYLLER,ph,T,233,false,"Brassinosteroid-Regulated Phosphorylation Dynamics",94,26187819,"MaxQuant Score",87.5660000,1.0000000,,,,0.013000000268221,-3.1960000
QQTLTISPTTR,ph,T,1050,true,"Tissue atlas Arabidopsis - ProteomicsDB",114,32188942,"MaxQuant score",164.2100000,0.8656540,,,,1.3810599885922E-10,
QQTLTISPTTR,ph,S,1052,true,"atm and atr DNA damage response",88,25561503,"MASCOT Score",43.0000000,0.9970000,,,,,-1.9700000
QQTLTISPTTR,ph,S,1052,true,"Tissue atlas Arabidopsis - ProteomicsDB",114,32188942,"MaxQuant score",148.9600000,0.8994250,,,,2.2996699655664E-8,
TPEKDTFSNGETTQLQEPETEDRPQK,ph,T,1070,true,"Tissue atlas Arabidopsis - ProteomicsDB",114,32188942,"MaxQuant score",63.2500000,0.9985970,,,,1.2823800261685E-6,
AGATGSITTPR,ph,T,1194,true,"Tissue atlas Arabidopsis - ProteomicsDB",114,32188942,"MaxQuant score",225.0400000,0.9257520,,,,2.2420775429197E-41,
AGATGSITTPR,ph,T,1195,true,"TOR Kinase and ABA Receptor",100,29290610,XCorr,2.7022531,0.9879000,,,,0.005220000166446,
AGATGSITTPR,ph,T,1195,true,"Tissue atlas Arabidopsis - ProteomicsDB",114,32188942,"MaxQuant score",228.7800000,0.9747920,,,,1.5267146768819E-41,
GSPQSAGFPFMTGR,ph,S,1216,true,"Tissue atlas Arabidopsis - ProteomicsDB",114,32188942,"MaxQuant score",142.5400000,0.9999350,,,,7.6401897786127E-7,
QNSNFMFLLER,ph,S,1510,true,"atm and atr DNA damage response",88,25561503,"MASCOT Score",45.0000000,1.0000000,,,,,0.1100000
QNSNFMFLLER,ph,S,1510,true,"TOR Kinase and ABA Receptor",100,29290610,XCorr,3.8989458,1.0000000,,,,2.1679999917978E-5,
QNSNFMFLLER,ph,S,1510,true,"Tissue atlas Arabidopsis - ProteomicsDB",114,32188942,"MaxQuant score",171.2000000,1.0000000,,,,3.6283899062378E-12,
