Peptide,PTM,ModifiedAA,ModifiedPosition,PeptideUniqueToGene,ExperimentDesc,ExpID,PubmedID,ScoreType,IdentScore,LocProb,Log2FChange,PQ-val,QuantSig,PEP,MassErrorPPM
AEPIPSSSLSPK,ph,S,11,true,"atm and atr DNA damage response",88,25561503,"MASCOT Score",63.0000000,1.0000000,,,,,-0.4500000
AEPIPSSSLSPK,ph,S,11,true,"Tissue atlas Arabidopsis - ProteomicsDB",114,32188942,"MaxQuant score",85.9090000,0.9132400,,,,0.00016486000095028,
AGLVGQSGHLPMLNGAAGAAQMNIQPQLLAASPR,ph,S,263,true,"Tissue atlas Arabidopsis - ProteomicsDB",114,32188942,"MaxQuant score",92.1550000,1.0000000,,,,2.5576200377425E-21,
QQLSQQNALTSPQVQNLQR,ph,S,332,true,"Tissue atlas Arabidopsis - ProteomicsDB",114,32188942,"MaxQuant score",343.3100000,0.9980410,,,,0,
QMSGITSPNSFR,ph,S,381,true,"atm and atr DNA damage response",88,25561503,"MASCOT Score",28.0000000,0.9850000,,,,,-0.6900000
QMSGITSPNSFR,ph,S,381,true,"Tissue atlas Arabidopsis - ProteomicsDB",114,32188942,"MaxQuant score",217.2000000,0.9960360,,,,5.1937894437551E-39,
ACSLAK,sno,C,570,false,"hot5-4 / wildtype, FAT-switch S-nitrosoproteome",169,37277371,,,,,,,,
ALLESSKPETNASNSKETMR,ph,S,631,true,"srk2dei ABA signaling phopshoproteomics",83,23572148,"MASCOT Score",22.0000000,,,,,,-0.0056000
ALLESSKPETNASNSKETMR,ph,T,635,true,"srk2dei ABA signaling phopshoproteomics",83,23572148,"MASCOT Score",23.0000000,,,,,,-0.0069000
ALLESSKPETNASNSKETMR,ph,S,638,true,"srk2dei ABA signaling phopshoproteomics",83,23572148,"MASCOT Score",23.0000000,,,,,,-0.0069000
ALLESSKPETNASNSK,ph,S,638,true,"Tissue atlas Arabidopsis - ProteomicsDB",114,32188942,"MaxQuant score",131.9400000,0.9841030,,,,1.4128899294974E-7,
QAMVNPNGPNHLLRPSQSSEQLVSQTSGPHILQHMTR,ph,S,661,true,"Tissue atlas Arabidopsis - ProteomicsDB",114,32188942,"MaxQuant score",110.5900000,0.7831490,,,,5.0166485022828E-43,
