Peptide,PTM,ModifiedAA,ModifiedPosition,PeptideUniqueToGene,ExperimentDesc,ExpID,PubmedID,ScoreType,IdentScore,LocProb,Log2FChange,PQ-val,QuantSig,PEP,MassErrorPPM
SGSNLDIENMRPLIR,ph,S,609,true,"atm and atr DNA damage response",88,25561503,"MASCOT Score",26.0000000,0.9990000,,,,,0.1900000
SGSNLDIENMRPLIR,ph,S,609,true,"TOR Kinase and ABA Receptor",100,29290610,XCorr,2.2702589,0.9193000,,,,0.00023590000637341,
SGSNLDIENMRPLIR,ph,S,609,true,"Tissue atlas Arabidopsis - ProteomicsDB",114,32188942,"MaxQuant score",164.5700000,0.9999910,,,,1.2930200530073E-13,
SGSNLDIENMR,ph,S,609,true,"atm and atr DNA damage response",88,25561503,"MASCOT Score",78.0000000,0.9960000,,,,,-0.4500000
FTPAEDIFERGSSK,ph,S,730,true,"TOR Kinase and ABA Receptor",100,29290610,XCorr,3.2854958,0.9059000,,,,0.00093179999385029,
FTPAEDIFERGSSK,ph,S,730,true,"Tissue atlas Arabidopsis - ProteomicsDB",114,32188942,"MaxQuant score",114.2100000,0.9333520,,,,1.5243999769154E-5,
SVSSDNLFTDR,ph,S,735,true,"Tissue atlas Arabidopsis - ProteomicsDB",114,32188942,"MaxQuant score",179.9300000,0.9998930,,,,5.2713401406477E-14,
SVSSDNLFTDR,ph,S,736,true,"Tissue atlas Arabidopsis - ProteomicsDB",114,32188942,"MaxQuant score",56.4140000,0.9740680,,,,0.010825499892235,
