Peptide,PTM,ModifiedAA,ModifiedPosition,PeptideUniqueToGene,ExperimentDesc,ExpID,PubmedID,ScoreType,IdentScore,LocProb,Log2FChange,PQ-val,QuantSig,PEP,MassErrorPPM
GEQVFSGSTCK,sno,C,210,true,"hot5-4 / wildtype, FAT-switch S-nitrosoproteome",169,37277371,,,,,,,,
LSQQGAITKR,ac,K,320,false,"Quantitative Acetylproteomics",101,29440448,,,,,,,,
LSQQGAITKR,ub,K,320,false,"Ubiquitination Membrane Proteins",120,33585938,,,,,,,,
EIHFLPFNPVDKR,ac,K,413,false,"Quantitative Acetylproteomics",101,29440448,,,,,,,,
ADGFAGVFPEHKYEIVK,ac,K,576,false,"Histone deacetylases substrates - hda14 vs WT",98e,29061669,"MaxQuant Score",46.2000000,1.0000000,-0.4210000,0.8375293,NO,0.00098000001162291,
ADGFAGVFPEHKYEIVK,ac,K,576,false,"Quantitative Acetylproteomics",101,29440448,,,,,,,,
DYGKDDGSPNVTISQR,ph,S,879,true,"Tissue atlas Arabidopsis - ProteomicsDB",114,32188942,"MaxQuant score",311.1900000,1.0000000,,,,0,
SRSAEELR,ph,S,890,true,"Tissue atlas Arabidopsis - ProteomicsDB",114,32188942,"MaxQuant score",113.6100000,0.9978660,,,,0.0013084700331092,
SRASWIAEQTR,ph,S,902,true,"Tissue atlas Arabidopsis - ProteomicsDB",114,32188942,"MaxQuant score",103.6000000,0.9995360,,,,0.00011127199832117,
ASWIAEQTR,ph,S,902,true,"atm and atr DNA damage response",88,25561503,"MASCOT Score",42.0000000,1.0000000,,,,,1.8100000
LLEVHSVSR,ph,S,922,true,"Tissue atlas Arabidopsis - ProteomicsDB",114,32188942,"MaxQuant score",151.9800000,0.9977390,,,,8.0332196375821E-5,
LLEVHSVSR,ph,S,924,true,"Tissue atlas Arabidopsis - ProteomicsDB",114,32188942,"MaxQuant score",83.1820000,0.8000260,,,,0.0034174399916083,
