Peptide,PTM,ModifiedAA,ModifiedPosition,PeptideUniqueToGene,ExperimentDesc,ExpID,PubmedID,ScoreType,IdentScore,LocProb,Log2FChange,PQ-val,QuantSig,PEP,MassErrorPPM
KGSSSDLSK,ph,S,236,true,"atm and atr DNA damage response",88,25561503,"MASCOT Score",38.0000000,1.0000000,,,,,-2.9400000
ATEVSPSNPTDILTSSSAENPKEPK,ph,S,250,true,"Tissue atlas Arabidopsis - ProteomicsDB",114,32188942,"MaxQuant score",252.7700000,0.9999420,,,,0,
ATEVSPSNPTDILTSSSAENPK,ph,S,250,true,"TOR Kinase and ABA Receptor",100,29290610,XCorr,6.1709948,0.9066000,,,,5.3209998895909E-7,
ATEVSPSNPTDILTSSSAENPKEPK,ph,S,262,true,"Tissue atlas Arabidopsis - ProteomicsDB",114,32188942,"MaxQuant score",218.3900000,0.7764800,,,,0,
SVHIKVIK,ac,K,285,true,"Histone deacetylases - apicidin vs control",98a,29061669,"MaxQuant Score",91.1000000,1.0000000,1.6600000,0.0023067,YES,0.0049999998882413,
KQPQPTSSSTPAPAKPEEK,ph,T,298,true,"Tissue atlas Arabidopsis - ProteomicsDB",114,32188942,"MaxQuant score",156.2000000,0.9127980,,,,3.1568100541896E-22,
KSDGAANTSLASLFQNYGSDEDED,ph,S,316,true,"Conserved plant phosphoproteome - Arabidopsis",61a,20466843,"MASCOT Score",98.0000000,1.0000000,,,,,
KSDGAANTSLASLFQNYGSDEDED,ph,Y,324,true,"srk2dei ABA signaling phopshoproteomics",83,23572148,"MASCOT Score",69.0000000,,,,,,0.0015000
KSDGAANTSLASLFQNYGSDEDED,ph,Y,324,true,"Col-0 callus - FC Col-0 vs. Col-0 Xray",111a,31410901,,51.8600000,,1.0742085,0.0276473,YES,,0.8671216
KSDGAANTSLASLFQNYGSDEDED,ph,Y,324,true,"Col-0 X-ray callus - FC Col-0 vs. Col-0 Xray",111b,31410901,,51.8600000,,1.0742085,0.0276473,YES,,0.8671216
KSDGAANTSLASLFQNYGSDEDED,ph,Y,324,true,"atm callus - FC atm vs. atm Xray",111c,31410901,,51.8600000,,0.4982596,0.2218519,NO,,0.8671216
KSDGAANTSLASLFQNYGSDEDED,ph,Y,324,true,"atm-3 X-ray callus - FC atm vs. atm Xray",111d,31410901,,51.8600000,,0.4982596,0.2218519,NO,,0.8671216
KSDGAANTSLASLFQNYGSDEDED,ph,S,326,true,"STN8 phosphoproteome",38,21768351,"MASCOT Score",54.4200000,,,,,,-1.7801200
KSDGAANTSLASLFQNYGSDEDED,ph,S,326,true,"srk2dei ABA signaling phopshoproteomics",83,23572148,"MASCOT Score",99.0000000,,,,,,-0.0045000
KSDGAANTSLASLFQNYGSDEDED,ph,S,326,true,"SnRK2 protein kinase substrates",85,23776212,XCorr,5.2568650,1.0000000,,,,3.96250006599E-16,
KSDGAANTSLASLFQNYGSDEDED,ph,S,326,true,"Brassinosteroid-Regulated Phosphorylation Dynamics",94,26187819,"MaxQuant Score",140.4500000,1.0000000,,,,4.8309998362805E-11,2.2110000
KSDGAANTSLASLFQNYGSDEDED,ph,S,326,true,"TOR Kinase and ABA Receptor",100,29290610,XCorr,6.2585659,0.9866000,,,,9.0550003051248E-8,
KSDGAANTSLASLFQNYGSDEDED,ph,S,326,true,"Col-0 callus - FC Col-0 vs. Col-0 Xray",111a,31410901,,89.5400000,,0.5567275,0.0000000,NO,,1.1424472
KSDGAANTSLASLFQNYGSDEDED,ph,S,326,true,"Col-0 X-ray callus - FC Col-0 vs. Col-0 Xray",111b,31410901,,89.5400000,,0.5567275,0.0000000,NO,,1.1424472
KSDGAANTSLASLFQNYGSDEDED,ph,S,326,true,"atm callus - FC atm vs. atm Xray",111c,31410901,,89.5400000,,0.7927610,0.0000000,NO,,1.1424472
KSDGAANTSLASLFQNYGSDEDED,ph,S,326,true,"atm-3 X-ray callus - FC atm vs. atm Xray",111d,31410901,,89.5400000,,0.7927610,0.0000000,NO,,1.1424472
SDGAANTSLASLFQNYGSDEDED,ph,S,326,true,"srk2dei ABA signaling phopshoproteomics",83,23572148,"MASCOT Score",40.0000000,,,,,,-0.0005000
