Peptide,PTM,ModifiedAA,ModifiedPosition,PeptideUniqueToGene,ExperimentDesc,ExpID,PubmedID,ScoreType,IdentScore,LocProb,Log2FChange,PQ-val,QuantSig,PEP,MassErrorPPM
TRPGTITTK,ph,T,69,true,"atm and atr DNA damage response",88,25561503,"MASCOT Score",28.0000000,0.8570000,,,,,-1.9700000
KLDVAPPSPQSPPSPPTLK,ph,S,89,true,"TOR Kinase and ABA Receptor",100,29290610,XCorr,3.5027249,1.0000000,,,,1.6620000451439E-6,
KLDVAPPSPQSPPSPPTLK,ph,S,89,true,"Tissue atlas Arabidopsis - ProteomicsDB",114,32188942,"MaxQuant score",64.8450000,0.9515510,,,,9.8128701210953E-5,
KLDVAPPSPQSPPSPPTLK,ph,S,95,true,"Large-scale phosphorylation discovery",44,23111157,XCorr,3.5470000,,,,,,
KLDVAPPSPQSPPSPPTLK,ph,S,95,true,"Tissue atlas Arabidopsis - ProteomicsDB",114,32188942,"MaxQuant score",104.6800000,0.8670050,,,,3.0612898882509E-8,
KLDDVNPVGLGR,nt,K,100,true,"Stromal N-terminome",96,26371235,"MASCOT Score",56.2600000,,,,,,
KLDDVNPVGLGR,nta,K,100,true,"Stromal N-terminome",96,26371235,"MASCOT Score",56.2600000,,,,,,
KLDDVNPVGLGR,nta,K,100,true,"HUNTER N-terminome: legumain, GluC and trypsin",119,31951383,"MaxQuant score",,,,,,,
SAVESCSK,ox,C,228,true,"SPEAR - 10 mM H2O2 / mock",138a,34619326,,,,3.9144027,0.0018577,YES,,
QRPVDGLAGAQQDLR,nt,Q,435,true,"HUNTER N-terminome: legumain, GluC and trypsin",119,31951383,"MaxQuant score",69.7290000,,,,,,
