Peptide,PTM,ModifiedAA,ModifiedPosition,PeptideUniqueToGene,ExperimentDesc,ExpID,PubmedID,ScoreType,IdentScore,LocProb,Log2FChange,PQ-val,QuantSig,PEP,MassErrorPPM
NFSLGSGGSMTSMGAQR,fuc,S,221,true,"SPINDLY O-fucosylation",162,36739885,,,,,,,0.46999999880791,
AHNINTASFQPVSR,og,S,398,true,"O-GlcNac Inflorescence Tissue",81,28154133,"MASCOT Score",36.4000000,,,,,,4.4000000
VNSSLSHQQQFQQPPNR,ph,S,402,true,"Tissue atlas Arabidopsis - ProteomicsDB",114,32188942,"MaxQuant score",227.8800000,0.9724230,,,,0,
SESSPQGQWPSK,ph,S,558,true,"Tissue atlas Arabidopsis - ProteomicsDB",114,32188942,"MaxQuant score",71.5310000,0.7885190,,,,0.003189830109477,
SSIVSTTEADLSQDAER,ph,S,807,true,"Tissue atlas Arabidopsis - ProteomicsDB",114,32188942,"MaxQuant score",120.2400000,0.9999990,,,,2.1171899788897E-9,
HGLSGDSPKQENIK,ph,S,869,true,"TOR Kinase and ABA Receptor",100,29290610,XCorr,2.8731945,0.8191000,,,,0.019819999113679,
HGLSGDSPKQENIK,ph,S,869,true,"Col-0 callus - FC Col-0 vs. Col-0 Xray",111a,31410901,,21.9000000,,-1.5546335,0.0000000,NO,,-0.0636155
HGLSGDSPKQENIK,ph,S,869,true,"Col-0 X-ray callus - FC Col-0 vs. Col-0 Xray",111b,31410901,,21.9000000,,-1.5546335,0.0000000,NO,,-0.0636155
HGLSGDSPKQENIK,ph,S,869,true,"atm callus - FC atm vs. atm Xray",111c,31410901,,21.9000000,,3.2265398,0.0000000,NO,,-0.0636155
HGLSGDSPKQENIK,ph,S,869,true,"atm-3 X-ray callus - FC atm vs. atm Xray",111d,31410901,,21.9000000,,3.2265398,0.0000000,NO,,-0.0636155
HGLSGDSPKQENIK,ph,S,869,true,"Tissue atlas Arabidopsis - ProteomicsDB",114,32188942,"MaxQuant score",214.3900000,0.9999990,,,,0,
EPGCPK,so,C,890,true,"S-sulfenylation site detection using YAP1C",110,32714340,,,,,,,,
KEELVESPELTSK,ph,S,899,true,"Large-scale phosphorylation discovery",44,23111157,XCorr,4.4760000,,,,,,
KEELVESPELTSK,ph,S,899,true,"atm and atr DNA damage response",88,25561503,"MASCOT Score",70.0000000,1.0000000,,,,,-1.3300000
KEELVESPELTSK,ph,S,899,true,"Tissue atlas Arabidopsis - ProteomicsDB",114,32188942,"MaxQuant score",293.7700000,1.0000000,,,,0,
KGILKKPITKR,ac,K,1359,true,"Histone deacetylases substrates - hda14 vs WT",98e,29061669,"MaxQuant Score",73.5000000,1.0000000,-0.0500000,0.9418896,NO,0.0020000000949949,
KGILKKPITK,ac,K,1359,true,"Quantitative Acetylproteomics",101,29440448,,,,,,,,
KGILKKPITKR,ac,K,1363,true,"Histone deacetylases substrates - hda14 vs WT",98e,29061669,"MaxQuant Score",73.5000000,1.0000000,-0.0500000,0.9418896,NO,0.0020000000949949,
KGILKKPITK,ac,K,1363,true,"Quantitative Acetylproteomics",101,29440448,,,,,,,,
KGILKKPITKR,ac,K,1364,true,"Histone deacetylases substrates - hda14 vs WT",98e,29061669,"MaxQuant Score",73.5000000,1.0000000,-0.0500000,0.9418896,NO,0.0020000000949949,
KGILKKPITK,ac,K,1364,true,"Quantitative Acetylproteomics",101,29440448,,,,,,,,
KGILKKPITKR,ac,K,1368,true,"Histone deacetylases substrates - hda14 vs WT",98e,29061669,"MaxQuant Score",73.5000000,1.0000000,-0.0500000,0.9418896,NO,0.0020000000949949,
LTTHPSLADQNAQNKEAR,ac,K,1587,true,"Histone deacetylases- hda14 vs WT (low light)",98c,29061669,"MaxQuant Score",335.4800000,1.0000000,0.1130000,0.9885531,NO,0,
LTTHPSLADQNAQNKEAR,ac,K,1587,true,"Histone deacetylases - hda14 vs WT (thylakoids)",98d,29061669,"MaxQuant Score",78.1000000,1.0000000,0.7650000,0.5058247,NO,1.2099999890935E-9,
