Peptide,PTM,ModifiedAA,ModifiedPosition,PeptideUniqueToGene,ExperimentDesc,ExpID,PubmedID,ScoreType,IdentScore,LocProb,Log2FChange,PQ-val,QuantSig,PEP,MassErrorPPM
AMAAASAATAKKLAPAVIVGGGR,nt,A,42,true,"Stromal N-terminome",96,26371235,"MASCOT Score",68.7400000,,,,,,
AMAAASAATAKKLAPAVIVGGGR,nta,A,42,true,"Arg/N-end rule pathway Roots",80,25728785,"MASCOT Score",26.2300000,,,,,0.019090000540018,
AMAAASAATAKKLAPAVIVGGGR,nta,A,42,true,"Stromal N-terminome",96,26371235,"MASCOT Score",68.7400000,,,,,,
AMAAASAATAKKLAPAVIVGGGR,nta,A,42,true,"Arabidopsis translation initiation landscape - NTA",167a,35069635,,,,,,,,
AMAAASAATAK,nta,A,42,true,"Characterization plant N-terminal acetylation",6,22223895,"MASCOT Score",87.9200000,,,,,,
AAASAATAKKLAPAVIVGGGR,nt,A,44,true,"Stromal N-terminome",96,26371235,"MASCOT Score",53.9100000,,,,,,
AAASAATAKKLAPAVIVGGGR,nta,A,44,true,"Stromal N-terminome",96,26371235,"MASCOT Score",45.6700000,,,,,,
AAASAATAKKLAPAVIVGGGR,nta,A,44,true,"Arabidopsis translation initiation landscape - NTA",167a,35069635,,,,,,,,
AAASAATAK,nta,A,44,true,"Characterization plant N-terminal acetylation",6,22223895,"MASCOT Score",39.8400000,,,,,,
AASAATAKKLAPAVIVGGGR,nt,A,45,true,"Stromal N-terminome",96,26371235,"MASCOT Score",71.0700000,,,,,,
AASAATAKKLAPAVIVGGGR,nt,A,45,true,"Arabidopsis translation initiation landscape - NT",167b,35069635,,,,,,,,
AASAATAKKLAPAVIVGGGR,nta,A,45,true,"Stromal N-terminome",96,26371235,"MASCOT Score",71.0700000,,,,,,
AASAATAKKLAPAVIVGGGR,nta,A,45,true,"Arabidopsis translation initiation landscape - NTA",167a,35069635,,,,,,,,
ALQEMGNGEDLLVKR,ac,K,81,true,"Quantitative Acetylproteomics",101,29440448,,,,,,,,
RGEAVPVDFEGPILVCTR,sno,C,97,true,"Site-specific nitrosomeproteomic id - gsnor1-3",90a,25699590,XCorr,2.5238271,,,,,0.36809998750687,-6.0529798
RGEAVPVDFEGPILVCTR,sno,C,97,true,"Site-specific nitrosomeproteomic id - gsnor1-3",90b,25699590,XCorr,2.3800000,,,,,0.00037669998710044,-5.6000000
GEAVPVDFEGPILVCTR,sno,C,97,true,"Site-specific nitrosomeproteomic id - gsnor1-3",90a,25699590,XCorr,2.0853918,,,,,0.0018339999951422,-4.6039720
WASEIAAR,ph,S,175,true,"STN8 phosphoproteome",38,21768351,"MASCOT Score",50.4700000,,,,,,0.2637210
WASEIAAR,ph,S,175,true,"atm and atr DNA damage response",88,25561503,"MASCOT Score",41.0000000,1.0000000,,,,,0.1600000
HPGASVGTVEK,ph,S,221,true,"Large-scale phosphorylation discovery",44,23111157,XCorr,2.1670000,,,,,,
HPGASVGTVEK,ph,T,224,true,"Large-scale phosphorylation discovery",44,23111157,XCorr,2.1670000,,,,,,
AVSHFPTAVKEFK,ac,K,275,true,"Histone deacetylases - apicidin vs control",98a,29061669,"MaxQuant Score",150.5000000,1.0000000,0.2770000,0.3076097,NO,9.300000361961E-16,
AVSHFPTAVKEFK,ac,K,275,true,"Histone deacetylases substrates - TSA vs control",98b,29061669,"MaxQuant Score",150.5000000,1.0000000,0.1440000,0.9977001,NO,9.300000361961E-16,
AVSHFPTAVKEFK,ac,K,275,true,"Histone deacetylases substrates - hda14 vs WT",98e,29061669,"MaxQuant Score",57.4000000,1.0000000,0.0510000,0.9204496,NO,0.00063999998383224,
AVSHFPTAVKEFK,ac,K,275,true,"Quantitative Acetylproteomics",101,29440448,,,,,,,,
