Peptide,PTM,ModifiedAA,ModifiedPosition,PeptideUniqueToGene,ExperimentDesc,ExpID,PubmedID,ScoreType,IdentScore,LocProb,Log2FChange,PQ-val,QuantSig,PEP,MassErrorPPM
ASMSSGDESLR,nt,A,2,true,"Arg/N-end rule seed, prt6 vs. Wt",99,29168982,"MASCOT Score",44.3000000,,,,,0.1233000010252,-0.4596460
ASMSSGDESLR,nta,A,2,true,"Arg/N-end rule seed, prt6 vs. Wt",99,29168982,"MASCOT Score",44.3000000,,,,,0.1233000010252,-0.4596460
ASMSSGDESLR,nta,A,2,true,"Arabidopsis translation initiation landscape - NTA",167a,35069635,,,,,,,,
KGPGSSEISSR,ph,S,268,true,"Tissue atlas Arabidopsis - ProteomicsDB",114,32188942,"MaxQuant score",95.6770000,0.9531820,,,,8.7446300312877E-5,
SNLAPVGSIDSLHSR,ph,S,282,true,"atm and atr DNA damage response",88,25561503,"MASCOT Score",75.0000000,1.0000000,,,,,0.3400000
SNLAPVGSIDSLHSR,ph,S,282,true,"Tissue atlas Arabidopsis - ProteomicsDB",114,32188942,"MaxQuant score",58.4790000,0.9670640,,,,0.00057513400679454,
SNLAPVGSIDSLHSR,ph,S,285,true,"atm and atr DNA damage response",88,25561503,"MASCOT Score",63.0000000,1.0000000,,,,,-0.1700000
SNLAPVGSIDSLHSR,ph,S,285,true,"Tissue atlas Arabidopsis - ProteomicsDB",114,32188942,"MaxQuant score",194.9400000,0.9983250,,,,2.8060299116876E-34,
SNLAPVGSIDSLHSR,ph,S,288,true,"TOR Kinase and ABA Receptor",100,29290610,XCorr,2.3916819,0.8631000,,,,0.0050499998033047,
SNLAPVGSIDSLHSR,ph,S,288,true,"Tissue atlas Arabidopsis - ProteomicsDB",114,32188942,"MaxQuant score",71.9460000,0.9843290,,,,0.00010592499893392,
