Peptide,PTM,ModifiedAA,ModifiedPosition,PeptideUniqueToGene,ExperimentDesc,ExpID,PubmedID,ScoreType,IdentScore,LocProb,Log2FChange,PQ-val,QuantSig,PEP,MassErrorPPM
MEGTSFHQASNSMR,ph,S,12,true,"Tissue atlas Arabidopsis - ProteomicsDB",114,32188942,"MaxQuant score",135.0800000,0.8842670,,,,3.5680000110005E-6,
KDSGREIFSR,ph,S,24,true,"Tissue atlas Arabidopsis - ProteomicsDB",114,32188942,"MaxQuant score",86.6990000,0.9999990,,,,0.0005899160169065,
SSREEDDEEALR,ph,S,32,true,"Tissue atlas Arabidopsis - ProteomicsDB",114,32188942,"MaxQuant score",108.3600000,0.8314090,,,,1.9105800674879E-5,
EIFSRSSREEDDEEALR,ph,S,33,true,"Tissue atlas Arabidopsis - ProteomicsDB",114,32188942,"MaxQuant score",108.3600000,0.9119040,,,,1.9105800674879E-5,
WAALEKLPTFDR,ph,T,52,true,"Tissue atlas Arabidopsis - ProteomicsDB",114,32188942,"MaxQuant score",175.1500000,1.0000000,,,,1.8046199571579E-14,
LPTFDRLR,ph,T,52,false,"Tissue atlas Arabidopsis - ProteomicsDB",114,32188942,"MaxQuant score",146.1100000,1.0000000,,,,0.010182499885559,
GILTASHAGGPINEIDIQK,ph,S,64,true,"Tissue atlas Arabidopsis - ProteomicsDB",114,32188942,"MaxQuant score",314.9000000,0.9999500,,,,0,
AVENSSETLGVTFLK,ng,N,729,true,"UDP-GlcNAc transporter glycopeptide analysis",135,30224661,,,,,,,3.0176590393172E-11,0.8000000
SEGVVEAGANK,ph,S,802,true,"Tissue atlas Arabidopsis - ProteomicsDB",114,32188942,"MaxQuant score",75.7390000,1.0000000,,,,0.0018553800182417,
