Peptide,PTM,ModifiedAA,ModifiedPosition,PeptideUniqueToGene,ExperimentDesc,ExpID,PubmedID,ScoreType,IdentScore,LocProb,Log2FChange,PQ-val,QuantSig,PEP,MassErrorPPM
STISFRR,ph,S,10,false,"Tissue atlas Arabidopsis - ProteomicsDB",114,32188942,"MaxQuant score",100.7600000,0.9999990,,,,0.013458100147545,
STISFR,ph,S,10,false,"srk2dei ABA signaling phopshoproteomics",83,23572148,"MASCOT Score",35.0000000,,,,,,-0.0001000
RQGSSGIVFDDRLIAELNK,ph,S,16,true,"MAPK Arabidopsis substrates",45,23172892,"MaxQuant Score",93.3710000,,,,,,
RQGSSGIVFDDR,ph,S,16,true,"STN8 phosphoproteome",38,21768351,"MASCOT Score",46.8100000,,,,,,-1.6008200
RQGSSGIVFDDR,ph,S,16,true,"Tyrosine phosphorylation in Arabidopsis",59,18463617,"MASCOT Score",49.0000000,,,,,,-0.2825619
RQGSSGIVFDDR,ph,S,16,true,"srk2dei ABA signaling phopshoproteomics",83,23572148,"MASCOT Score",54.0000000,,,,,,-0.0006000
RQGSSGIVFDDR,ph,S,16,true,"atm and atr DNA damage response",88,25561503,"MASCOT Score",63.0000000,0.9540000,,,,,0.0300000
RQGSSGIVFDDR,ph,S,16,true,"TOR Kinase and ABA Receptor",100,29290610,XCorr,3.2572532,0.9242000,,,,0.0024399999529123,
RQGSSGIVFDDR,ph,S,16,true,"Tissue atlas Arabidopsis - ProteomicsDB",114,32188942,"MaxQuant score",293.4300000,1.0000000,,,,0,
QGSSGIVFDDR,ph,S,16,true,"STN8 phosphoproteome",38,21768351,"MASCOT Score",40.4700000,,,,,,-0.4125000
QGSSGIVFDDR,ph,S,16,true,"Large-scale phosphorylation discovery",44,23111157,XCorr,3.7330000,,,,,,
QGSSGIVFDDR,ph,S,16,true,"Tyrosine phosphorylation in Arabidopsis",59,18463617,"MASCOT Score",52.0000000,,,,,,-0.3969773
QGSSGIVFDDR,ph,S,16,true,"srk2dei ABA signaling phopshoproteomics",83,23572148,"MASCOT Score",61.0000000,,,,,,0.0008000
QGSSGIVFDDR,ph,S,16,true,"LAXIC - mannitol vs control",84b,23660473,XCorr,2.1900000,0.9840000,,,,6.2799997976981E-5,
QGSSGIVFDDR,ph,S,16,true,"SnRK2 protein kinase substrates",85,23776212,XCorr,2.1881454,0.9950000,,,,0.038373298943043,
QGSSGIVFDDR,ph,S,16,true,"atm and atr DNA damage response",88,25561503,"MASCOT Score",47.0000000,1.0000000,,,,,-0.1000000
QGSSGIVFDDR,ph,S,16,true,"Protein sumoylation and phosphorylation cross-talk",97,28419593,,,,,,,,
QGSSGIVFDDR,ph,S,16,true,"Lateral root-induction - NAA vs control",106,23328941,"MASCOT Score",35.0000000,,,,,,
QGSSGIVFDDR,ph,S,16,true,"Phospho cell culture sucrose/TOR",109,30833711,,,0.7985590,,,,,
QGSSGIVFDDR,ph,S,16,true,"Col-0 callus - FC Col-0 vs. Col-0 Xray",111a,31410901,,52.8200000,,0.0698743,0.0000000,NO,,0.0414363
QGSSGIVFDDR,ph,S,16,true,"Col-0 X-ray callus - FC Col-0 vs. Col-0 Xray",111b,31410901,,52.8200000,,0.0698743,0.0000000,NO,,0.0414363
QGSSGIVFDDR,ph,S,16,true,"atm callus - FC atm vs. atm Xray",111c,31410901,,52.8200000,,-0.1912651,0.0000000,NO,,0.0414363
QGSSGIVFDDR,ph,S,16,true,"atm-3 X-ray callus - FC atm vs. atm Xray",111d,31410901,,52.8200000,,-0.1912651,0.0000000,NO,,0.0414363
RQGSSGIVFDDR,ph,S,17,true,"atm and atr DNA damage response",88,25561503,"MASCOT Score",36.0000000,1.0000000,,,,,0.2800000
RQGSSGIVFDDR,ph,S,17,true,"Tissue atlas Arabidopsis - ProteomicsDB",114,32188942,"MaxQuant score",114.3100000,1.0000000,,,,2.1990699679009E-5,
QGSSGIVFDDR,ph,S,17,true,"Tyrosine phosphorylation in Arabidopsis",59,18463617,"MASCOT Score",45.0000000,,,,,,-0.4763728
QGSSGIVFDDR,ph,S,17,true,"srk2dei ABA signaling phopshoproteomics",83,23572148,"MASCOT Score",47.0000000,,,,,,0.0001000
QGSSGIVFDDR,ph,S,17,true,"atm and atr DNA damage response",88,25561503,"MASCOT Score",36.0000000,1.0000000,,,,,1.0500000
QGSSGIVFDDR,ph,S,17,true,"Lateral root-induction - NAA vs control",106,23328941,"MASCOT Score",27.0000000,,,,,,
LIAELNKSGNNEQKDESQR,ub,K,38,true,"Arabidopsis ubiquitination COFRADIC",40,26744219,"MaxQuant Score",83.4230000,1.0000000,,,,1.8559999592988E-14,0.4090000
LRPIKTGGGAPGGIER,ph,T,71,true,"Phosphorylation Early Elicitor Signaling",23,17317660,,,,,,,,
LRPIKTGGGAPGGIER,ph,T,71,true,"Tissue atlas Arabidopsis - ProteomicsDB",114,32188942,"MaxQuant score",74.5840000,1.0000000,,,,0.00024216600286309,
TTGRVSPAVDPPSPR,ph,S,100,true,"Phytohormone-responsive phosphoproteins",34,20374526,"MASCOT Score",46.0000000,,,,,,5.9438000
TTGRVSPAVDPPSPR,ph,S,100,true,"STN8 phosphoproteome",38,21768351,"MASCOT Score",59.3400000,,,,,,
TTGRVSPAVDPPSPR,ph,S,100,true,"Large-scale phosphorylation discovery",44,23111157,XCorr,2.6440000,,,,,,
TTGRVSPAVDPPSPR,ph,S,100,true,"Phosphoproteome ethylene-regulated time response",46,24043427,"MASCOT Score",47.0300000,,,,,,29.2918000
TTGRVSPAVDPPSPR,ph,S,100,true,"Chloroplast kinase substrates",60,19376835,"MASCOT Score",53.3400000,,,,,,-1.7549000
TTGRVSPAVDPPSPR,ph,S,100,true,"srk2dei ABA signaling phopshoproteomics",83,23572148,"MASCOT Score",33.0000000,,,,,,-0.0002000
TTGRVSPAVDPPSPR,ph,S,100,true,"LAXIC - ABA stress",84a,23660473,XCorr,3.5600000,0.9800000,,,,0.09909900277853,
TTGRVSPAVDPPSPR,ph,S,100,true,"LAXIC - mannitol vs control",84b,23660473,XCorr,3.2700000,0.9970000,,,,0.0096230898052454,
TTGRVSPAVDPPSPR,ph,S,100,true,"SnRK2 protein kinase substrates",85,23776212,XCorr,2.3427424,0.9650000,,,,0.062594503164291,
TTGRVSPAVDPPSPR,ph,S,100,true,"atm and atr DNA damage response",88,25561503,"MASCOT Score",36.0000000,0.9330000,,,,,1.3900000
TTGRVSPAVDPPSPR,ph,S,100,true,"Protein sumoylation and phosphorylation cross-talk",97,28419593,,,,,,,,
TTGRVSPAVDPPSPR,ph,S,100,true,"TOR Kinase and ABA Receptor",100,29290610,XCorr,3.8808603,0.9907000,,,,0.00023089999740478,
TTGRVSPAVDPPSPR,ph,S,100,true,"Phosphorylation tonoplast membrane fraction",107,18686298,"MASCOT Score",39.0000000,,,,,,
TTGRVSPAVDPPSPR,ph,S,100,true,"Phospho cell culture sucrose/TOR",109,30833711,,,0.8953670,,,,,
TTGRVSPAVDPPSPR,ph,S,100,true,"Col-0 callus - FC Col-0 vs. Col-0 Xray",111a,31410901,,30.7300000,,-0.1598678,0.0000000,NO,,0.7839528
TTGRVSPAVDPPSPR,ph,S,100,true,"Col-0 X-ray callus - FC Col-0 vs. Col-0 Xray",111b,31410901,,30.7300000,,-0.1598678,0.0000000,NO,,0.7839528
TTGRVSPAVDPPSPR,ph,S,100,true,"atm callus - FC atm vs. atm Xray",111c,31410901,,30.7300000,,-0.5847989,0.0000000,NO,,0.7839528
TTGRVSPAVDPPSPR,ph,S,100,true,"atm-3 X-ray callus - FC atm vs. atm Xray",111d,31410901,,30.7300000,,-0.5847989,0.0000000,NO,,0.7839528
VSPAVDPPSPR,ph,S,100,false,"Plasmamembrane phosphorylation",20,15308754,,,,,,,,
VSPAVDPPSPR,ph,S,100,false,"Sucrose-induced phosphorylation",24,17586839,,,,,,,,
VSPAVDPPSPR,ph,S,100,false,"Ethylene-regulated phosphorylation ein2 mutant",30,19253305,"MASCOT Score",38.0952000,,,,,,-5.9103790
VSPAVDPPSPR,ph,S,100,false,"Phosphoproteome ethylene-regulated time response",46,24043427,"MASCOT Score",43.7600000,,,,,,-4.6835000
VSPAVDPPSPR,ph,S,100,false,"Conserved plant phosphoproteome - Arabidopsis",61a,20466843,"MASCOT Score",47.0000000,1.0000000,,,,,
VSPAVDPPSPR,ph,S,100,false,"LAXIC - ABA stress",84a,23660473,XCorr,2.1200000,1.0000000,,,,0.095386400818825,
VSPAVDPPSPR,ph,S,100,false,"LAXIC - mannitol vs control",84b,23660473,XCorr,2.8700000,1.0000000,,,,0.0011473100166768,
VSPAVDPPSPR,ph,S,100,false,"atm and atr DNA damage response",88,25561503,"MASCOT Score",57.0000000,1.0000000,,,,,0.3900000
VSPAVDPPSPR,ph,S,100,false,"Phosphorylation tonoplast membrane fraction",107,18686298,"MASCOT Score",40.0000000,,,,,,
VSPAVDPPSPR,ph,S,100,false,"Tissue atlas Arabidopsis - ProteomicsDB",114,32188942,"MaxQuant score",178.2300000,1.0000000,,,,4.7975300716973E-25,
TTGRVSPAVDPPSPR,ph,S,107,true,"Mitochondrial phosphoproteome",32,19688752,"MASCOT Score",39.8700000,,,,,,6.2970000
TTGRVSPAVDPPSPR,ph,S,107,true,"Phytohormone-responsive phosphoproteins",34,20374526,"MASCOT Score",46.0000000,,,,,,5.9438000
TTGRVSPAVDPPSPR,ph,S,107,true,"Phosphoproteome ethylene-regulated time response",46,24043427,"MASCOT Score",47.0300000,,,,,,29.2918000
TTGRVSPAVDPPSPR,ph,S,107,true,"Chloroplast kinase substrates",60,19376835,"MASCOT Score",53.3400000,,,,,,-1.7549000
TTGRVSPAVDPPSPR,ph,S,107,true,"Conserved plant phosphoproteome - Arabidopsis",61a,20466843,"MASCOT Score",30.0000000,1.0000000,,,,,
TTGRVSPAVDPPSPR,ph,S,107,true,"srk2dei ABA signaling phopshoproteomics",83,23572148,"MASCOT Score",33.0000000,,,,,,-0.0002000
TTGRVSPAVDPPSPR,ph,S,107,true,"LAXIC - ABA stress",84a,23660473,XCorr,3.5600000,1.0000000,,,,0.09909900277853,
TTGRVSPAVDPPSPR,ph,S,107,true,"LAXIC - mannitol vs control",84b,23660473,XCorr,3.2700000,1.0000000,,,,0.0096230898052454,
TTGRVSPAVDPPSPR,ph,S,107,true,"SnRK2 protein kinase substrates",85,23776212,XCorr,2.3427424,1.0000000,,,,0.062594503164291,
TTGRVSPAVDPPSPR,ph,S,107,true,"atm and atr DNA damage response",88,25561503,"MASCOT Score",36.0000000,1.0000000,,,,,1.3900000
TTGRVSPAVDPPSPR,ph,S,107,true,"Protein sumoylation and phosphorylation cross-talk",97,28419593,,,,,,,,
TTGRVSPAVDPPSPR,ph,S,107,true,"TOR Kinase and ABA Receptor",100,29290610,XCorr,3.6653397,1.0000000,,,,0.0016439999453723,
TTGRVSPAVDPPSPR,ph,S,107,true,"Phosphorylation tonoplast membrane fraction",107,18686298,"MASCOT Score",39.0000000,,,,,,
TTGRVSPAVDPPSPR,ph,S,107,true,"Col-0 callus - FC Col-0 vs. Col-0 Xray",111a,31410901,,30.7300000,,-0.1598678,0.0000000,NO,,0.7839528
TTGRVSPAVDPPSPR,ph,S,107,true,"Col-0 X-ray callus - FC Col-0 vs. Col-0 Xray",111b,31410901,,30.7300000,,-0.1598678,0.0000000,NO,,0.7839528
TTGRVSPAVDPPSPR,ph,S,107,true,"atm callus - FC atm vs. atm Xray",111c,31410901,,30.7300000,,-0.5847989,0.0000000,NO,,0.7839528
TTGRVSPAVDPPSPR,ph,S,107,true,"atm-3 X-ray callus - FC atm vs. atm Xray",111d,31410901,,30.7300000,,-0.5847989,0.0000000,NO,,0.7839528
VSPAVDPPSPR,ph,S,107,false,"Plasmamembrane phosphorylation",20,15308754,,,,,,,,
VSPAVDPPSPR,ph,S,107,false,"Sucrose-induced phosphorylation",24,17586839,,,,,,,,
VSPAVDPPSPR,ph,S,107,false,"Ethylene-regulated phosphorylation ein2 mutant",30,19253305,"MASCOT Score",38.0952000,,,,,,-5.9103790
VSPAVDPPSPR,ph,S,107,false,"Mitochondrial phosphoproteome",32,19688752,"MASCOT Score",45.1700000,,,,,,-0.0360748
VSPAVDPPSPR,ph,S,107,false,"Large-scale phosphorylation discovery",44,23111157,XCorr,2.8420000,,,,,,
VSPAVDPPSPR,ph,S,107,false,"Phosphoproteome ethylene-regulated time response",46,24043427,"MASCOT Score",63.2500000,,,,,,1.1988000
VSPAVDPPSPR,ph,S,107,false,"Tyrosine phosphorylation in Arabidopsis",59,18463617,"MASCOT Score",57.0000000,,,,,,-0.1665898
VSPAVDPPSPR,ph,S,107,false,"Conserved plant phosphoproteome - Arabidopsis",61a,20466843,"MASCOT Score",47.0000000,1.0000000,,,,,
VSPAVDPPSPR,ph,S,107,false,"srk2dei ABA signaling phopshoproteomics",83,23572148,"MASCOT Score",58.0000000,,,,,,-0.0001000
VSPAVDPPSPR,ph,S,107,false,"LAXIC - ABA stress",84a,23660473,XCorr,2.8000000,1.0000000,,,,0.013012000359595,
VSPAVDPPSPR,ph,S,107,false,"LAXIC - mannitol vs control",84b,23660473,XCorr,2.8700000,1.0000000,,,,0.0011473100166768,
VSPAVDPPSPR,ph,S,107,false,"SnRK2 protein kinase substrates",85,23776212,XCorr,2.5637414,1.0000000,,,,0.0043081599287689,
VSPAVDPPSPR,ph,S,107,false,"atm and atr DNA damage response",88,25561503,"MASCOT Score",57.0000000,1.0000000,,,,,0.3900000
VSPAVDPPSPR,ph,S,107,false,"Protein sumoylation and phosphorylation cross-talk",97,28419593,,,,,,,,
VSPAVDPPSPR,ph,S,107,false,"TOR Kinase and ABA Receptor",100,29290610,XCorr,3.2121611,1.0000000,,,,5.8419998822501E-5,
VSPAVDPPSPR,ph,S,107,false,"Lateral root-induction - NAA vs control",106,23328941,"MASCOT Score",51.0000000,,,,,,
VSPAVDPPSPR,ph,S,107,false,"Phosphorylation tonoplast membrane fraction",107,18686298,"MASCOT Score",40.0000000,,,,,,
VSPAVDPPSPR,ph,S,107,false,"Phospho cell culture sucrose/TOR",109,30833711,,,1.0000000,,,,,
VSPAVDPPSPR,ph,S,107,false,"Col-0 callus - FC Col-0 vs. Col-0 Xray",111a,31410901,,32.4900000,,-1.0701961,0.0320038,YES,,-1.4696634
VSPAVDPPSPR,ph,S,107,false,"Col-0 X-ray callus - FC Col-0 vs. Col-0 Xray",111b,31410901,,32.4900000,,-1.0701961,0.0320038,YES,,-1.4696634
VSPAVDPPSPR,ph,S,107,false,"atm callus - FC atm vs. atm Xray",111c,31410901,,32.4900000,,-1.9773614,0.0240356,YES,,-1.4696634
VSPAVDPPSPR,ph,S,107,false,"atm-3 X-ray callus - FC atm vs. atm Xray",111d,31410901,,32.4900000,,-1.9773614,0.0240356,YES,,-1.4696634
VSPAVDPPSPR,ph,S,107,false,"Tissue atlas Arabidopsis - ProteomicsDB",114,32188942,"MaxQuant score",189.6100000,1.0000000,,,,4.7975300716973E-25,
VSPAVDPPSPR,ph,S,107,false,"Touch-induced phosphorylation: 40s touch vs untouc",136,30291188,"MASCOT score",55.1600000,,0.0202116,0.8480091,NO,,6.6610891
ISSCGCCSAFGKNPPGK,acy,C,113,true,"Arabidopsis S-acylation atlas - Seedling",163d,35681017,,,,,,,,
ISSCGCCSAFGK,acy,C,113,true,"Arabidopsis S-acylation atlas - Meristem",163a,35681017,,,,,,,,
ISSCGCCSAFGK,acy,C,113,true,"Arabidopsis S-acylation atlas - Leaf",163c,35681017,,,,,,,,
ISSCGCCSAFGK,acy,C,113,true,"Arabidopsis S-acylation atlas - Silique",163e,35681017,,,,,,,,
ISSCGCCSAFGK,acy,C,113,true,"Arabidopsis S-acylation atlas - Stem",163f,35681017,,,,,,,,
ISSCGCCSAFGKNPPGK,acy,C,115,true,"Arabidopsis S-acylation atlas - Seedling",163d,35681017,,,,,,,,
ISSCGCCSAFGK,acy,C,115,true,"Arabidopsis S-acylation atlas - Meristem",163a,35681017,,,,,,,,
ISSCGCCSAFGK,acy,C,115,true,"Arabidopsis S-acylation atlas - Leaf",163c,35681017,,,,,,,,
ISSCGCCSAFGK,acy,C,115,true,"Arabidopsis S-acylation atlas - Silique",163e,35681017,,,,,,,,
ISSCGCCSAFGK,acy,C,115,true,"Arabidopsis S-acylation atlas - Stem",163f,35681017,,,,,,,,
ISSCGCCSAFGKNPPGK,acy,C,116,true,"Arabidopsis S-acylation atlas - Seedling",163d,35681017,,,,,,,,
ISSCGCCSAFGK,acy,C,116,true,"Arabidopsis S-acylation atlas - Meristem",163a,35681017,,,,,,,,
ISSCGCCSAFGK,acy,C,116,true,"Arabidopsis S-acylation atlas - Leaf",163c,35681017,,,,,,,,
ISSCGCCSAFGK,acy,C,116,true,"Arabidopsis S-acylation atlas - Silique",163e,35681017,,,,,,,,
ISSCGCCSAFGK,acy,C,116,true,"Arabidopsis S-acylation atlas - Stem",163f,35681017,,,,,,,,
