Peptide,PTM,ModifiedAA,ModifiedPosition,PeptideUniqueToGene,ExperimentDesc,ExpID,PubmedID,ScoreType,IdentScore,LocProb,Log2FChange,PQ-val,QuantSig,PEP,MassErrorPPM
MEATKERVGLL,nta,M,1,true,"Arabidopsis translation initiation landscape - NTA",167a,35069635,,,,,,,,
MEATKERVGL,nta,M,1,true,"N-term acetylation drought responses",5,26184543,,,,,,,,
MEATKER,ub,K,5,false,"Arabidopsis ubiquitination COFRADIC",40,26744219,"MaxQuant Score",63.5650000,1.0000000,,,,0.0089999996125698,0.8970000
KAANAVKSR,ub,K,46,true,"Arabidopsis ubiquitination COFRADIC",40,26744219,"MaxQuant Score",63.0730000,1.0000000,,,,0.0099999997764826,0.4320000
AASIFDHEEEDGCLADPIPETADK,ph,S,51,true,"Tissue atlas Arabidopsis - ProteomicsDB",114,32188942,"MaxQuant score",41.4830000,0.9999280,,,,0.0013781499583274,
DTGPCLAGK,ox,C,86,true,"OxiTRAQ Arabidopsis - 5 mM H2O2 versus control",47,24376095,,,,-0.4590581,0.0843027,NO,,
DLDVEGIER,nt,D,122,true,"Metacaspase9 substrates - in vitro rMC9",51c,23964026,"MASCOT Score",50.0000000,,3.1339992,,NO,,0.0000000
DLDVEGIERSSEK,ph,S,131,true,"atm and atr DNA damage response",88,25561503,"MASCOT Score",29.0000000,0.9380000,,,,,0.6500000
SSEKKDQSDEDEEEEMKPILVEGFV,ph,S,138,true,"Phosphoproteomic analysis of seed maturation",42,22440515,"MASCOT Score",42.0000000,,,,,,-1.5000000
SSEKKDQSDEDEEEEMKPILVEGFV,ph,S,138,true,"SnRK2 protein kinase substrates",85,23776212,XCorr,3.8921235,0.9670000,,,,1.0684199835617E-13,
KDQSDEDEEEEMKPILVEGFV,ph,S,138,true,"Tyrosine phosphorylation in Arabidopsis",59,18463617,"MASCOT Score",30.0000000,,,,,,-1.4144948
KDQSDEDEEEEMKPILVEGFV,ph,S,138,true,"srk2dei ABA signaling phopshoproteomics",83,23572148,"MASCOT Score",61.0000000,,,,,,0.0007000
KDQSDEDEEEEMKPILVEGFV,ph,S,138,true,"Brassinosteroid-Regulated Phosphorylation Dynamics",94,26187819,"MaxQuant Score",88.0900000,1.0000000,,,,0.0040000001899898,2.1540000
KDQSDEDEEEEMKPILVEGFV,ph,S,138,true,"TOR Kinase and ABA Receptor",100,29290610,XCorr,4.4876637,1.0000000,,,,0.0012080000014976,
KDQSDEDEEEEMKPILVEGFV,ph,S,138,true,"Phospho cell culture sucrose/TOR",109,30833711,,,1.0000000,,,,,
KDQSDEDEEEEMKPILVEGFV,ph,S,138,true,"Tissue atlas Arabidopsis - ProteomicsDB",114,32188942,"MaxQuant score",276.7800000,1.0000000,,,,0,
DQSDEDEEEEMKPILVEGFV,ph,S,138,true,"Large-scale phosphorylation discovery",44,23111157,XCorr,5.0220000,,,,,,
DQSDEDEEEEMKPILVEGFV,ph,S,138,true,"TOR Kinase and ABA Receptor",100,29290610,XCorr,3.5227804,1.0000000,,,,0.00096279999706894,
EEEMKPILVEGFV,nt,E,143,true,"Arabidopsis translation initiation landscape - NT",167b,35069635,,,,,,,,
