Peptide,PTM,ModifiedAA,ModifiedPosition,PeptideUniqueToGene,ExperimentDesc,ExpID,PubmedID,ScoreType,IdentScore,LocProb,Log2FChange,PQ-val,QuantSig,PEP,MassErrorPPM
GDTALEKTAEELR,nt,G,2,true,"Arg/N-end rule seed, prt6 vs. Wt",99,29168982,"MASCOT Score",34.3600000,,,,,0.010080000385642,-0.7087641
GDTALEKTAEELRHEIDELHR,nta,G,2,true,"Arabidopsis translation initiation landscape - NTA",167a,35069635,,,,,,,,
GDTALEKTAEELR,nta,G,2,true,"Arg/N-end rule pathway Roots",80,25728785,"MASCOT Score",46.3800000,,,,,0.0003912000101991,
GDTALEKTAEELR,nta,G,2,true,"Arg/N-end rule seed, prt6 vs. Wt",99,29168982,"MASCOT Score",34.3600000,,0.1000886,0.3188493,NO,0.010080000385642,-0.7087641
GDTALEKTAEELR,ub,K,8,true,"Arabidopsis ubiquitination COFRADIC",40,26744219,"MaxQuant Score",130.1000000,1.0000000,,,,9.7510000901112E-15,0.2320000
NDVEDEPPAKR,ub,K,71,true,"Arabidopsis ubiquitination COFRADIC",40,26744219,"MaxQuant Score",107.0300000,1.0000000,,,,3.7959999588111E-8,-0.1730000
VLPKNEDPKLVNR,ub,K,153,true,"Arabidopsis ubiquitination COFRADIC",40,26744219,"MaxQuant Score",77.8940000,1.0000000,,,,9.0139998064842E-5,-1.1950000
VLPKNEDPKLVNR,ub,K,158,true,"Arabidopsis ubiquitination COFRADIC",40,26744219,"MaxQuant Score",66.0040000,1.0000000,,,,0.00022289999469649,0.5920000
ENLTEKR,ub,K,222,true,"Arabidopsis ubiquitination COFRADIC",40,26744219,"MaxQuant Score",90.3080000,1.0000000,,,,0.020999999716878,-0.4820000
IYYAPVKPLEEDTSEVEQQKER,ph,S,281,true,"Phospho cell culture sucrose/TOR",109,30833711,,,0.7886180,,,,,
IYYAPVKPLEEDTSEVEQQK,ph,S,281,true,"Tissue atlas Arabidopsis - ProteomicsDB",114,32188942,"MaxQuant score",209.4100000,0.9652840,,,,0,
IYYAPVKPLEEDTSEVEQQKER,ub,K,287,true,"Arabidopsis ubiquitination COFRADIC",40,26744219,"MaxQuant Score",179.1900000,1.0000000,,,,0,-0.8570000
KANNEGMNLQETMDKELETHR,ub,K,346,true,"Arabidopsis ubiquitination COFRADIC",40,26744219,"MaxQuant Score",43.1640000,0.9990000,,,,5.7820001529763E-5,-0.5870000
MEHGPKKR,ub,K,359,true,"Arabidopsis ubiquitination COFRADIC",40,26744219,"MaxQuant Score",77.9230000,0.8820000,,,,0.003000000026077,-0.5040000
