Peptide,PTM,ModifiedAA,ModifiedPosition,PeptideUniqueToGene,ExperimentDesc,ExpID,PubmedID,ScoreType,IdentScore,LocProb,Log2FChange,PQ-val,QuantSig,PEP,MassErrorPPM
ASSSLSNLMLAIHE,nt,A,2,true,"Arg/N-end rule seed, prt6 vs. Wt",99,29168982,"MASCOT Score",76.8500000,,,,,1.3690000244537E-9,-2.3306118
ASSSLSNLMLAIHE,nta,A,2,true,"Arg/N-end rule seed, prt6 vs. Wt",99,29168982,"MASCOT Score",76.8500000,,,,,1.3690000244537E-9,-2.3306118
ASSSLSNLMLAIHE,nta,A,2,true,"HUNTER N-terminome: legumain, GluC and trypsin",119,31951383,"MaxQuant score",190.4600000,,,,,,
ASSSLSNLMLAIHE,nta,A,2,true,"Arabidopsis translation initiation landscape - NTA",167a,35069635,,,,,,,,
ASSSLSNLMLAIHEKK,ph,S,3,true,"BSK8 and BSL2 regulating sucrose-ph synthase",66,24924143,"MaxQuant Score",41.3780000,,,,,,0.7844700
ASSSLSNLMLAIHEKK,ph,S,5,true,"BSK8 and BSL2 regulating sucrose-ph synthase",66,24924143,"MaxQuant Score",41.3780000,,,,,,0.7844700
ASSSLSNLMLAIHEKK,ph,S,7,true,"BSK8 and BSL2 regulating sucrose-ph synthase",66,24924143,"MaxQuant Score",41.3780000,,,,,,0.7844700
LMVAQAQECVFENTIAK,so,C,201,true,"Arabidopsis S-sulfenylation chemoproteomics",108,31578252,"pFind PSM Score",0.2563670,,2.5000000,,,,-0.9774893
LMVAQAQECVFENTIAK,so,C,201,true,"S-sulfenylation site detection using YAP1C",110,32714340,,,,,,,,
GSTPGVSAK,ph,T,212,true,"atm and atr DNA damage response",88,25561503,"MASCOT Score",41.0000000,1.0000000,,,,,-1.0600000
QQCSDFVMTR,so,C,700,true,"Arabidopsis S-sulfenylation chemoproteomics",108,31578252,"pFind PSM Score",0.1288510,,,,,,-0.1445494
QMSGLSFQDHR,nt,Q,721,true,"HUNTER N-terminome: legumain, GluC and trypsin",119,31951383,"MaxQuant score",68.3550000,,,,,,
QMSGLSFQDHR,ph,S,723,true,"Tissue atlas Arabidopsis - ProteomicsDB",114,32188942,"MaxQuant score",136.0100000,1.0000000,,,,2.0840300294367E-6,
QMSGLSFQDHR,ph,S,726,true,"atm and atr DNA damage response",88,25561503,"MASCOT Score",25.0000000,0.9850000,,,,,-0.7600000
QMSGLSFQDHR,ph,S,726,true,"Tissue atlas Arabidopsis - ProteomicsDB",114,32188942,"MaxQuant score",131.0600000,0.9999060,,,,3.6742499105458E-6,
