Peptide,PTM,ModifiedAA,ModifiedPosition,PeptideUniqueToGene,ExperimentDesc,ExpID,PubmedID,ScoreType,IdentScore,LocProb,Log2FChange,PQ-val,QuantSig,PEP,MassErrorPPM
MYACFYSGK,acy,C,76,true,"Arabidopsis S-acylation atlas - Hypocotyl",163b,35681017,,,,,,,,
MYACFYSGK,acy,C,76,true,"Arabidopsis S-acylation atlas - Silique",163e,35681017,,,,,,,,
MYACFYSGK,acy,C,76,true,"Arabidopsis S-acylation atlas - Stem",163f,35681017,,,,,,,,
MYACFYSGKMR,ub,K,81,true,"upl3 mutant / wildtype",168,35926874,"MaxQuant score",62.6330000,1.0000000,0.2041407,,,0.001404260052368,-0.1370400
AQYNIKGDGCTDCLK,ub,K,89,true,"upl3 mutant / wildtype",168,35926874,"MaxQuant score",123.2900000,1.0000000,0.6088092,0.6526200,NO,2.401050025469E-8,-1.0369000
AQYNIKGDGCTDCLK,acy,C,93,true,"Arabidopsis S-acylation atlas - Stem",163f,35681017,,,,,,,,
GDGCTDCLK,acy,C,93,false,"Arabidopsis S-acylation atlas - Leaf",163c,35681017,,,,,,,,
GDGCTDCLK,acy,C,93,false,"Arabidopsis S-acylation atlas - Stem",163f,35681017,,,,,,,,
AQYNIKGDGCTDCLK,acy,C,96,true,"Arabidopsis S-acylation atlas - Stem",163f,35681017,,,,,,,,
GDGCTDCLK,acy,C,96,false,"Arabidopsis S-acylation atlas - Leaf",163c,35681017,,,,,,,,
GDGCTDCLK,acy,C,96,false,"Arabidopsis S-acylation atlas - Stem",163f,35681017,,,,,,,,
QQNQGGVAMGAPAFQGGMTR,ph,T,150,true,"Tissue atlas Arabidopsis - ProteomicsDB",114,32188942,"MaxQuant score",112.4200000,1.0000000,,,,4.115780199293E-12,
