Peptide,PTM,ModifiedAA,ModifiedPosition,PeptideUniqueToGene,ExperimentDesc,ExpID,PubmedID,ScoreType,IdentScore,LocProb,Log2FChange,PQ-val,QuantSig,PEP,MassErrorPPM
SQDDEIVMRD,nt,S,2,true,"N-term acetylation drought responses",5,26184543,,,,,,,,
SQDDEIVMR,nt,S,2,true,"FtsH12 N-terminome: WT / FtsH12 knockdown miRNA",118,33216923,"MaxQuant score",149.6900000,,1.5790356,0.0151704,YES,0,
SQDDEIVMRD,nta,S,2,true,"N-term acetylation drought responses",5,26184543,,,,,,,,
SQDDEIVMR,nta,S,2,true,"Characterization plant N-terminal acetylation",6,22223895,"MASCOT Score",58.9400000,,,,,,
SQDDEIVMR,nta,S,2,true,"Arg/N-end rule pathway Roots",80,25728785,"MASCOT Score",30.5300000,,,,,0.05316000059247,
SQDDEIVMR,nta,S,2,true,"Arabidopsis translation initiation landscape - NTA",167a,35069635,,,,,,,,
DSSVHSQAGSSSGPSSR,ph,S,451,true,"Tissue atlas Arabidopsis - ProteomicsDB",114,32188942,"MaxQuant score",205.6500000,0.9903540,,,,0,
DSSVHSQAGSSSGPSSR,ph,S,452,true,"Tissue atlas Arabidopsis - ProteomicsDB",114,32188942,"MaxQuant score",205.6500000,0.9762590,,,,0,
DSSVHSQAGSSSGPSSR,ph,S,453,true,"atm and atr DNA damage response",88,25561503,"MASCOT Score",45.0000000,0.9950000,,,,,-0.2300000
DSSVHSQAGSSSGPSSR,ph,S,453,true,"Tissue atlas Arabidopsis - ProteomicsDB",114,32188942,"MaxQuant score",109.0400000,0.9104860,,,,8.2158599923332E-9,
IVGMPQFDGSSGLSNTR,ph,S,628,true,"Tissue atlas Arabidopsis - ProteomicsDB",114,32188942,"MaxQuant score",126.0100000,0.9268130,,,,1.3578700386319E-9,
IVGMPQFDGSSGLSNTR,ph,T,630,true,"Tissue atlas Arabidopsis - ProteomicsDB",114,32188942,"MaxQuant score",142.8800000,0.7589100,,,,1.1397299770621E-11,
NLFGAYSNGGESANKR,ph,S,760,true,"Tissue atlas Arabidopsis - ProteomicsDB",114,32188942,"MaxQuant score",84.5660000,0.9875020,,,,7.2208102210425E-5,
NLFGAYSNGGESANKR,ph,S,765,true,"atm and atr DNA damage response",88,25561503,"MASCOT Score",84.0000000,1.0000000,,,,,0.4300000
NLFGAYSNGGESANKR,ph,S,765,true,"Tissue atlas Arabidopsis - ProteomicsDB",114,32188942,"MaxQuant score",231.8500000,1.0000000,,,,0,
NLFGAYSNGGESANK,ph,S,765,true,"Tyrosine phosphorylation in Arabidopsis",59,18463617,"MASCOT Score",44.0000000,,,,,,-1.1818422
LPYSPAELAATEVR,ph,S,775,true,"Tissue atlas Arabidopsis - ProteomicsDB",114,32188942,"MaxQuant score",125.6700000,0.9999930,,,,3.7399699067464E-5,
GTVDDISPR,ph,S,869,true,"Tissue atlas Arabidopsis - ProteomicsDB",114,32188942,"MaxQuant score",110.5200000,1.0000000,,,,0.00051372800953686,
AALTSDAEEKENVAR,ph,S,901,true,"Phospho cell culture sucrose/TOR",109,30833711,,,0.9943340,,,,,
AALTSDAEEKENVAR,ph,S,901,true,"Tissue atlas Arabidopsis - ProteomicsDB",114,32188942,"MaxQuant score",157.5800000,0.9993800,,,,5.5886601769972E-12,
VPGSADLQTVCK,sno,C,930,true,"hot5-4 / wildtype, FAT-switch S-nitrosoproteome",169,37277371,,,,,,,,
SLASPLASPTLDEASR,ph,S,996,true,"Tissue atlas Arabidopsis - ProteomicsDB",114,32188942,"MaxQuant score",168.6700000,0.9896870,,,,4.0028900938211E-19,
ELDESLLSPFSF,ph,S,1460,true,"TOR Kinase and ABA Receptor",100,29290610,XCorr,2.4653876,0.8452000,,,,0.020749999210238,
