Peptide,PTM,ModifiedAA,ModifiedPosition,PeptideUniqueToGene,ExperimentDesc,ExpID,PubmedID,ScoreType,IdentScore,LocProb,Log2FChange,PQ-val,QuantSig,PEP,MassErrorPPM
SLQESAPSLAVVGVTGAVGQEFLSVLSDRD,nt,S,33,true,"HUNTER N-terminome: legumain, GluC and trypsin",119,31951383,"MaxQuant score",64.5320000,,,,,,
SLQESAPSLAVVGVTGAVGQEFLSVLSDR,nt,S,33,true,"Stromal N-terminome",96,26371235,"MASCOT Score",51.3500000,,,,,,
SLQESAPSLAVVGVTGAVGQEFLSVLSDR,nt,S,33,true,"HUNTER N-terminome: legumain, GluC and trypsin",119,31951383,"MaxQuant score",127.6400000,,,,,,
SLQESAPSLAVVGVTGAVGQEFL,nt,S,33,true,"Arabidopsis translation initiation landscape - NT",167b,35069635,,,,,,,,
GTIVVDNSSAFR,nt,G,124,true,"Metacaspase9 substrates - in vitro rMC9",51c,23964026,"MASCOT Score",56.0000000,,4.2934140,,NO,,-1.1987851
GTIVVDNSSAFR,ph,S,132,true,"srk2dei ABA signaling phopshoproteomics",83,23572148,"MASCOT Score",45.0000000,,,,,,0.0011000
GTIVVDNSSAFR,ph,S,132,true,"atm and atr DNA damage response",88,25561503,"MASCOT Score",65.0000000,0.9440000,,,,,-1.1000000
GTIVVDNSSAFR,ph,S,132,true,"Phospho cell culture sucrose/TOR",109,30833711,,,0.7936470,,,,,
GTIVVDNSSAFR,ph,S,132,true,"Tissue atlas Arabidopsis - ProteomicsDB",114,32188942,"MaxQuant score",216.8100000,0.9616890,,,,5.4510201976573E-39,
MVVSTYQAASGAGAAAMEELVQQTR,ph,S,200,true,"Phospho cell culture sucrose/TOR",109,30833711,,,0.7822800,,,,,
KIWNDTEVK,ph,T,266,true,"Tissue atlas Arabidopsis - ProteomicsDB",114,32188942,"MaxQuant score",169.9800000,1.0000000,,,,0.00016780200530775,
VTATCIR,sno,C,274,true,"hot5-4 / wildtype, FAT-switch S-nitrosoproteome",169,37277371,,,,,,,,
VTATCIRVPVMR,so,C,274,true,"S-sulfenylation site detection using YAP1C",110,32714340,,,,,,,,
VTATCIR,so,C,274,true,"Arabidopsis S-sulfenylation chemoproteomics",108,31578252,"pFind PSM Score",0.1685500,,1.0000000,,,,-1.1857379
EILKKAPGVYIIDDR,ub,K,306,true,"Arabidopsis ubiquitination COFRADIC",40,26744219,"MaxQuant Score",60.4890000,0.8070000,,,,3.3349999739585E-6,1.5610000
ASNTFPTPLDVSNKDDVAVGR,ub,K,330,true,"Arabidopsis ubiquitination COFRADIC",40,26744219,"MaxQuant Score",46.9530000,1.0000000,,,,1.8990000683061E-7,2.9420000
DVSQDGNFGLDIFVCGDQIR,so,C,355,true,"S-sulfenylation site detection using YAP1C",110,32714340,,,,,,,,
AVQIAEMLL,nt,A,367,true,"Arabidopsis translation initiation landscape - NT",167b,35069635,,,,,,,,
