Peptide,PTM,ModifiedAA,ModifiedPosition,PeptideUniqueToGene,ExperimentDesc,ExpID,PubmedID,ScoreType,IdentScore,LocProb,Log2FChange,PQ-val,QuantSig,PEP,MassErrorPPM
RNQPGNPNPDAEVIALSPK,ph,S,72,true,"Large-scale phosphorylation discovery",44,23111157,XCorr,4.9360000,,,,,,
RNQPGNPNPDAEVIALSPK,ph,S,72,true,"atm and atr DNA damage response",88,25561503,"MASCOT Score",69.0000000,1.0000000,,,,,0.1900000
RNQPGNPNPDAEVIALSPK,ph,S,72,true,"Tissue atlas Arabidopsis - ProteomicsDB",114,32188942,"MaxQuant score",197.6000000,1.0000000,,,,1.4012984643248E-45,
NQPGNPNPDAEVIALSPK,ph,S,72,true,"STN8 phosphoproteome",38,21768351,"MASCOT Score",70.4000000,,,,,,-2.0677400
NQPGNPNPDAEVIALSPK,ph,S,72,true,"Large-scale phosphorylation discovery",44,23111157,XCorr,4.4600000,,,,,,
NQPGNPNPDAEVIALSPK,ph,S,72,true,"Chloroplast kinase substrates",60,19376835,"MASCOT Score",72.0800000,,,,,,-0.7494560
NQPGNPNPDAEVIALSPK,ph,S,72,true,"srk2dei ABA signaling phopshoproteomics",83,23572148,"MASCOT Score",74.0000000,,,,,,-0.0007000
NQPGNPNPDAEVIALSPK,ph,S,72,true,"LAXIC - ABA stress",84a,23660473,XCorr,4.9300000,1.0000000,,,,0.00022525299573317,
NQPGNPNPDAEVIALSPK,ph,S,72,true,"LAXIC - mannitol vs control",84b,23660473,XCorr,3.8600000,1.0000000,,,,0.0017753200372681,
NQPGNPNPDAEVIALSPK,ph,S,72,true,"SnRK2 protein kinase substrates",85,23776212,XCorr,3.7417777,1.0000000,,,,1.1677900313423E-10,
NQPGNPNPDAEVIALSPK,ph,S,72,true,"atm and atr DNA damage response",88,25561503,"MASCOT Score",97.0000000,1.0000000,,,,,-0.1300000
NQPGNPNPDAEVIALSPK,ph,S,72,true,"TOR Kinase and ABA Receptor",100,29290610,XCorr,5.1911430,1.0000000,,,,2.7699999805009E-7,
NQPGNPNPDAEVIALSPK,ph,S,72,true,"Touch-induced phosphorylation: 40s touch vs untouc",136,30291188,"MASCOT score",80.0200000,,-0.0586542,0.7472288,NO,,4.6027597
ALGDLTGIKK,ph,T,143,false,"Tissue atlas Arabidopsis - ProteomicsDB",114,32188942,"MaxQuant score",52.4950000,1.0000000,,,,0.0075205098837614,
