Peptide,PTM,ModifiedAA,ModifiedPosition,PeptideUniqueToGene,ExperimentDesc,ExpID,PubmedID,ScoreType,IdentScore,LocProb,Log2FChange,PQ-val,QuantSig,PEP,MassErrorPPM
MEGIQHPIPRTVEEVFSDF,nta,M,1,true,"Arabidopsis translation initiation landscape - NTA",167a,35069635,,,,,,,,
MEGIQHPIPR,nta,M,1,true,"Arg/N-end rule pathway Roots",80,25728785,"MASCOT Score",42.6300000,,,,,2.3329999748967E-5,
MEGIQHPIPR,nta,M,1,true,"Arg/N-end rule seed, prt6 vs. Wt",99,29168982,"MASCOT Score",75.2300000,,,,,0.0037259999662638,-1.2802922
MEGIQHPIPR,nta,M,1,true,"FtsH12 N-terminome: WT / FtsH12 knockdown miRNA",118,33216923,"MaxQuant score",69.7210000,,,,,0.014318999834359,
TVEEVFSDFR,ph,S,17,false,"Tissue atlas Arabidopsis - ProteomicsDB",114,32188942,"MaxQuant score",114.7600000,1.0000000,,,,0.00018887300393544,
FYHQCDPEK,sno,C,41,true,"Site-specific nitrosomeproteomic id - gsnor1-3",90a,25699590,XCorr,2.3228652,,,,,0.0014609999489039,-6.7296967
SKSSGGKPR,nt,S,156,true,"Arabidopsis translation initiation landscape - NT",167b,35069635,,,,,,,,
ASKMSPPPR,ph,S,176,true,"Chloroplast kinase substrates",60,19376835,"MASCOT Score",55.5700000,,,,,,0.2291540
ASKMSPPPR,ph,S,176,true,"Tissue atlas Arabidopsis - ProteomicsDB",114,32188942,"MaxQuant score",116.4100000,0.9999950,,,,0.00068398902658373,
KEDESGDEDEDDEQGAVCGACGDNYGGDEFWICCDACEK,ph,S,185,true,"SnRK2 protein kinase substrates",85,23776212,XCorr,4.1258855,0.9990000,,,,5.2532598715516E-8,
