Peptide,PTM,ModifiedAA,ModifiedPosition,PeptideUniqueToGene,ExperimentDesc,ExpID,PubmedID,ScoreType,IdentScore,LocProb,Log2FChange,PQ-val,QuantSig,PEP,MassErrorPPM
DPGTTSSWK,ph,S,36,false,"Tissue atlas Arabidopsis - ProteomicsDB",114,32188942,"MaxQuant score",179.5700000,0.7658910,,,,1.0923199624813E-6,
NGGDSCLEETR,ph,S,133,true,"atm and atr DNA damage response",88,25561503,"MASCOT Score",47.0000000,1.0000000,,,,,-0.1700000
NGGDSCLEETR,ph,S,133,true,"Tissue atlas Arabidopsis - ProteomicsDB",114,32188942,"MaxQuant score",148.0800000,1.0000000,,,,2.6848100631582E-8,
ELDLSIGRK,ph,S,160,true,"Tissue atlas Arabidopsis - ProteomicsDB",114,32188942,"MaxQuant score",112.8300000,1.0000000,,,,0.00034693398629315,
NFPSHHLHVASGLSVVR,ph,S,181,true,"Tissue atlas Arabidopsis - ProteomicsDB",114,32188942,"MaxQuant score",113.0900000,0.9963760,,,,2.5137298909073E-9,
DESDETEDFSNSENFPTK,ph,S,190,true,"Tissue atlas Arabidopsis - ProteomicsDB",114,32188942,"MaxQuant score",356.1500000,1.0000000,,,,0,
VSSPLLLK,ph,S,208,true,"atm and atr DNA damage response",88,25561503,"MASCOT Score",30.0000000,0.9980000,,,,,-2.0700000
VSSPLLLK,ph,S,208,true,"TOR Kinase and ABA Receptor",100,29290610,XCorr,3.0085375,0.9519000,,,,0.00057189998915419,
VSSPLLLK,ph,S,208,true,"Tissue atlas Arabidopsis - ProteomicsDB",114,32188942,"MaxQuant score",147.2400000,0.9999980,,,,0.0019136499613523,
SCCSPSFSDTLR,ph,S,307,false,"Tissue atlas Arabidopsis - ProteomicsDB",114,32188942,"MaxQuant score",198.8100000,0.9999920,,,,5.9809298979032E-25,
SCCSPSFSDTLR,ph,S,311,false,"Tissue atlas Arabidopsis - ProteomicsDB",114,32188942,"MaxQuant score",198.8100000,0.9949000,,,,5.9809298979032E-25,
KGSSILCGSQSVYR,ph,S,319,true,"Tissue atlas Arabidopsis - ProteomicsDB",114,32188942,"MaxQuant score",181.8600000,0.9982420,,,,7.858540198858E-23,
KGSSILCGSQSVYR,ph,S,320,true,"Tissue atlas Arabidopsis - ProteomicsDB",114,32188942,"MaxQuant score",105.3900000,0.8579520,,,,7.6067197369412E-5,
SQDGEREEEEEGGSTPESIQSLSQK,ph,S,403,true,"Tissue atlas Arabidopsis - ProteomicsDB",114,32188942,"MaxQuant score",127.2000000,0.9999660,,,,1.4012984643248E-45,
SQDGEREEEEEGGSTPESIQSLSQK,ph,S,416,true,"Plasmamembrane phosphorylation",20,15308754,,,,,,,,
SQDGEREEEEEGGSTPESIQSLSQK,ph,S,416,true,"Tissue atlas Arabidopsis - ProteomicsDB",114,32188942,"MaxQuant score",147.7400000,0.9996100,,,,2.256090527563E-43,
SQDGEREEEEEGGSTPESIQSLSQK,ph,T,417,true,"Tissue atlas Arabidopsis - ProteomicsDB",114,32188942,"MaxQuant score",220.8700000,0.9989880,,,,0,
SGLQCSNTASPTSIRK,ph,S,815,true,"Tissue atlas Arabidopsis - ProteomicsDB",114,32188942,"MaxQuant score",110.8200000,0.9974330,,,,4.4733301365341E-6,
SGLQCSNTASPTSIR,ph,S,815,true,"atm and atr DNA damage response",88,25561503,"MASCOT Score",37.0000000,0.9340000,,,,,-0.0600000
SGLQCSNTASPTSIRK,ph,T,817,true,"Tissue atlas Arabidopsis - ProteomicsDB",114,32188942,"MaxQuant score",100.7700000,0.7644960,,,,2.7631000193651E-5,
SGLQCSNTASPTSIR,ph,S,819,true,"Phosphorylation Early Elicitor Signaling",23,17317660,,,,,,,,
SGLQCSNTASPTSIR,ph,S,819,true,"atm and atr DNA damage response",88,25561503,"MASCOT Score",37.0000000,0.9950000,,,,,-0.0600000
SGLQCSNTASPTSIR,ph,S,819,true,"Tissue atlas Arabidopsis - ProteomicsDB",114,32188942,"MaxQuant score",317.6000000,0.9998920,,,,0,
SGLQCSNTASPTSIRK,ph,S,822,true,"Tissue atlas Arabidopsis - ProteomicsDB",114,32188942,"MaxQuant score",97.5020000,0.9962540,,,,2.7631000193651E-5,
QIAVTTSSYTESGNEIPMKR,ph,S,971,true,"Tissue atlas Arabidopsis - ProteomicsDB",114,32188942,"MaxQuant score",127.3800000,0.9670810,,,,6.2077001568155E-18,
LETEWLQKTPGSQGR,ph,T,997,true,"Tissue atlas Arabidopsis - ProteomicsDB",114,32188942,"MaxQuant score",216.7100000,0.9995460,,,,0,
ICEMGEFQENQSGKR,ph,S,1036,true,"Phosphorylation Early Elicitor Signaling",23,17317660,,,,,,,,
ICEMGEFQENQSGKR,ph,S,1036,true,"Tissue atlas Arabidopsis - ProteomicsDB",114,32188942,"MaxQuant score",64.2000000,1.0000000,,,,0.00021302199456841,
ICEMGEFQENQSGK,ph,S,1036,true,"Phosphorylation Early Elicitor Signaling",23,17317660,,,,,,,,
MEHCPVSPSLLHNSNFTNNK,ph,S,1046,true,"Tissue atlas Arabidopsis - ProteomicsDB",114,32188942,"MaxQuant score",225.2600000,0.9999600,,,,0,
DNLGYESESGR,ph,S,1066,true,"atm and atr DNA damage response",88,25561503,"MASCOT Score",52.0000000,1.0000000,,,,,0.3500000
DNLGYESESGR,ph,S,1066,true,"Tissue atlas Arabidopsis - ProteomicsDB",114,32188942,"MaxQuant score",181.4400000,0.9834560,,,,0,
