Peptide,PTM,ModifiedAA,ModifiedPosition,PeptideUniqueToGene,ExperimentDesc,ExpID,PubmedID,ScoreType,IdentScore,LocProb,Log2FChange,PQ-val,QuantSig,PEP,MassErrorPPM
GNCLDSSAK,myr,G,2,false,"N-Terminal Myristoylated Proteins",102,29453228,,,,,,,,
VDNSNHSPHANSASSGSK,ph,S,17,true,"atm and atr DNA damage response",88,25561503,"MASCOT Score",60.0000000,0.9450000,,,,,-1.1200000
TEGEILSSPNLK,ph,S,67,false,"Tissue atlas Arabidopsis - ProteomicsDB",114,32188942,"MaxQuant score",157.5600000,0.9052660,,,,8.9844198747357E-10,
TEGEILSSPNLK,ph,S,68,false,"Tissue atlas Arabidopsis - ProteomicsDB",114,32188942,"MaxQuant score",188.1500000,0.9506550,,,,1.7470300106364E-20,
PGSGIVVAVK,ph,S,117,false,"atm and atr DNA damage response",88,25561503,"MASCOT Score",57.0000000,1.0000000,,,,,-1.7800000
PGSGIVVAVK,ph,S,117,false,"Tissue atlas Arabidopsis - ProteomicsDB",114,32188942,"MaxQuant score",305.6100000,1.0000000,,,,0,
FHHSSVMQKSPVR,ph,S,396,true,"Tissue atlas Arabidopsis - ProteomicsDB",114,32188942,"MaxQuant score",199.6500000,1.0000000,,,,1.6697200185281E-31,
YSHDRPLLHMTPGASPLPSYTQSPR,ph,S,414,true,"Tissue atlas Arabidopsis - ProteomicsDB",114,32188942,"MaxQuant score",72.8410000,0.9360770,,,,3.4445399865746E-9,
