Peptide,PTM,ModifiedAA,ModifiedPosition,PeptideUniqueToGene,ExperimentDesc,ExpID,PubmedID,ScoreType,IdentScore,LocProb,Log2FChange,PQ-val,QuantSig,PEP,MassErrorPPM
SDEEHHFESSDAGASKTYPQQAGTIRKNGY,nta,S,2,true,"Arabidopsis translation initiation landscape - NTA",167a,35069635,,,,,,,,
SDEEHHFESSDAGASKTYPQQAGTIR,nta,S,2,true,"Arg/N-end rule pathway Roots",80,25728785,"MASCOT Score",30.2500000,,,,,0.0020159999839962,
SDEEHHFESSDAGASK,ph,S,2,true,"Arabidopsis root NAA phosphoproteome",18a,27643528,"MaxQuant Score",68.6390000,1.0000000,,,,3.3310000162601E-6,0.2830000
SDEEHHFESSDAGASK,ph,S,2,true,"Phospho cell culture sucrose/TOR",109,30833711,,,1.0000000,,,,,
SDEEHHFESSDAGASK,ph,S,2,true,"Tissue atlas Arabidopsis - ProteomicsDB",114,32188942,"MaxQuant score",240.5000000,1.0000000,,,,0,
SDEEHHFESSDAGASK,ph,S,11,true,"Tissue atlas Arabidopsis - ProteomicsDB",114,32188942,"MaxQuant score",308.7800000,0.9211520,,,,0,
VVEVSTSKTGK,ac,K,48,false,"Quantitative Acetylproteomics",101,29440448,,,,,,,,
CHFVAIDIFTSK,so,C,57,false,"S-sulfenylation site detection using YAP1C",110,32714340,,,,,,,,
KLEDIVPSSHNCDVPHVNR,ub,K,69,false,"upl3 mutant / wildtype",168,35926874,"MaxQuant score",102.8400000,1.0000000,0.3138263,0.2853400,NO,1.7637899474288E-10,-2.3201000
KLEDIVPSSHNCDVPHVNR,ph,S,76,false,"Tissue atlas Arabidopsis - ProteomicsDB",114,32188942,"MaxQuant score",51.2640000,0.7850120,,,,0.00088311301078647,
KLEDIVPSSHNCDVPHVNR,ph,S,77,false,"Tissue atlas Arabidopsis - ProteomicsDB",114,32188942,"MaxQuant score",80.8350000,0.9454640,,,,2.7037900508731E-5,
KLEDIVPSSHNCDVPHVNR,ox,C,80,false,"SPEAR - 10 mM H2O2 / mock",138a,34619326,,,,1.2055819,0.0417749,YES,,
KLEDIVPSSHNCDVPHVNR,ox,C,80,false,"SPEAR - 50 mM H2O2 / mock",138b,34619326,,,,1.8751567,0.0000535,YES,,
KLEDIVPSSHNCDVPHVNR,sno,C,80,false,"hot5-4 / wildtype, FAT-switch S-nitrosoproteome",169,37277371,,,,0.0892407,0.7126361,NO,,
LEDIVPSSHNCDVPHVNR,sno,C,80,false,"Site-specific nitrosomeproteomic id - gsnor1-3",90a,25699590,XCorr,3.3076959,,,,,6.5849999373313E-6,-4.8818223
LEDIVPSSHNCDVPHVNR,sno,C,80,false,"Site-specific nitrosomeproteomic id - gsnor1-3",90b,25699590,XCorr,3.6000000,,,,,0.031099999323487,-5.6600000
LEDIVPSSHNCDVPHVNR,sno,C,80,false,"hot5-4 / wildtype, FAT-switch S-nitrosoproteome",169,37277371,,,,,,,,
KLEDIVPSSHNCDVPHVNR,so,C,80,false,"S-sulfenylation site detection using YAP1C",110,32714340,,,,,,,,
LEDIVPSSHNCDVPHVNR,so,C,80,false,"Arabidopsis S-sulfenylation chemoproteomics",108,31578252,"pFind PSM Score",0.0015716,,1.4418200,,,,0.4560853
