Peptide,PTM,ModifiedAA,ModifiedPosition,PeptideUniqueToGene,ExperimentDesc,ExpID,PubmedID,ScoreType,IdentScore,LocProb,Log2FChange,PQ-val,QuantSig,PEP,MassErrorPPM
MNFISDQVK,mox,M,1,true,"cat2 Methionine oxidation - 3h stress",62b,25693801,"MASCOT Score",63.0000000,,-0.1780854,,NO,,
MNFISDQVKKLSSSTPEEPDHNKPVEGTETATR,nta,M,1,true,"Stromal N-terminome",96,26371235,"MASCOT Score",38.6700000,,,,,,
MNFISDQVKKLSS,nta,M,1,true,"Stromal N-terminome",96,26371235,"MASCOT Score",45.7100000,,,,,,
MNFISDQVKKL,nta,M,1,true,"Stromal N-terminome",96,26371235,"MASCOT Score",51.3300000,,,,,,
MNFISDQVKKL,nta,M,1,true,"Arg/N-end rule seed, prt6 vs. Wt",99,29168982,"MASCOT Score",41.7100000,,-0.7595746,0.0145524,NO,0.018659999594092,-0.3881799
MNFISDQVKK,nta,M,1,true,"N-term acetylation drought responses",5,26184543,,,,,,,,
MNFISDQVK,nta,M,1,true,"Characterization plant N-terminal acetylation",6,22223895,"MASCOT Score",56.9300000,,,,,,
MNFISDQVKK,ac,K,9,true,"Quantitative Acetylproteomics",101,29440448,,,,,,,,
MNFISDQVKK,ub,K,9,true,"upl3 mutant / wildtype",168,35926874,"MaxQuant score",81.0170000,1.0000000,0.5459684,0.1580020,NO,0.00070596701698378,-0.1399300
LSSSTPEEPDHNKPVEGTETATRPATNAELMASAK,ph,T,15,true,"Tissue atlas Arabidopsis - ProteomicsDB",114,32188942,"MaxQuant score",101.8900000,0.9225280,,,,1.0486199842465E-28,
LSSSTPEEPDHNKPVEGTETATR,ph,T,15,true,"atm and atr DNA damage response",88,25561503,"MASCOT Score",38.0000000,0.9070000,,,,,-0.8900000
ASAKVVAEAAQAAAR,nt,A,42,true,"Stromal N-terminome",96,26371235,"MASCOT Score",86.3700000,,,,,,
ASAKVVAEAAQAAAR,nta,A,42,true,"Stromal N-terminome",96,26371235,"MASCOT Score",86.3700000,,,,,,
ASAKVVAEAAQAAAR,nta,A,42,true,"Arabidopsis translation initiation landscape - NTA",167a,35069635,,,,,,,,
NESDKLDK,ph,S,59,true,"atm and atr DNA damage response",88,25561503,"MASCOT Score",37.0000000,1.0000000,,,,,-0.9600000
NESDKLDK,ac,K,61,true,"Histone deacetylases substrates - hda14 vs WT",98e,29061669,"MaxQuant Score",56.3000000,1.0000000,0.1830000,0.9289664,NO,0.021999999880791,
NESDKLDK,ac,K,61,true,"Quantitative Acetylproteomics",101,29440448,,,,,,,,
NESDKLDKGK,ac,K,64,true,"Quantitative Acetylproteomics",101,29440448,,,,,,,,
GKVAGASADILDAAEK,ub,K,66,true,"upl3 mutant / wildtype",168,35926874,"MaxQuant score",88.3850000,1.0000000,,,,1.7964099470191E-6,-0.0304160
VAGASADILDAAEKYGK,ph,S,71,true,"Protein sumoylation and phosphorylation cross-talk",97,28419593,,,,,,,,
VAGASADILDAAEKYGK,ph,S,71,true,"Touch-induced phosphorylation: 40s touch vs untouc",136,30291188,"MASCOT score",98.6500000,,0.2025747,0.4484524,NO,,3.1751639
VAGASADILDAAEK,ph,S,71,true,"STN8 phosphoproteome",38,21768351,"MASCOT Score",127.3300000,,,,,,-0.4571800
VAGASADILDAAEK,ph,S,71,true,"Chloroplast kinase substrates",60,19376835,"MASCOT Score",118.0300000,,,,,,-0.5421870
VAGASADILDAAEK,ph,S,71,true,"srk2dei ABA signaling phopshoproteomics",83,23572148,"MASCOT Score",99.0000000,,,,,,-0.0007000
VAGASADILDAAEK,ph,S,71,true,"LAXIC - ABA stress",84a,23660473,XCorr,4.4000000,1.0000000,,,,7.4200002586622E-8,
VAGASADILDAAEK,ph,S,71,true,"SnRK2 protein kinase substrates",85,23776212,XCorr,4.0619740,1.0000000,,,,0.0018090700032189,
VAGASADILDAAEK,ph,S,71,true,"atm and atr DNA damage response",88,25561503,"MASCOT Score",111.0000000,1.0000000,,,,,-0.9500000
VAGASADILDAAEK,ph,S,71,true,"TOR Kinase and ABA Receptor",100,29290610,XCorr,4.7407613,1.0000000,,,,5.6480001120462E-8,
VAGASADILDAAEK,ph,S,71,true,"Lateral root-induction - NAA vs control",106,23328941,"MASCOT Score",72.0000000,,-0.1569761,0.4131627,NO,,
VAGASADILDAAEK,ph,S,71,true,"Tissue atlas Arabidopsis - ProteomicsDB",114,32188942,"MaxQuant score",179.7900000,1.0000000,,,,1.3124599473234E-22,
VAGASADILDAAEK,ph,S,71,true,"Touch-induced phosphorylation: 40s touch vs untouc",136,30291188,"MASCOT score",111.2200000,,0.1162177,0.1071812,NO,,14.9397854
VAGASADILDAAEKYGK,ac,K,80,true,"Histone deacetylases substrates - hda14 vs WT",98e,29061669,"MaxQuant Score",66.0000000,1.0000000,0.1630000,0.9289664,NO,3.9999998989515E-5,
VAGASADILDAAEKYGK,ub,K,80,true,"upl3 mutant / wildtype",168,35926874,"MaxQuant score",102.0800000,1.0000000,-0.6281624,0.0536850,NO,4.9744400598684E-8,0.5575900
FDEKSSTGQYLDK,ac,K,87,true,"Histone deacetylases substrates - hda14 vs WT",98e,29061669,"MaxQuant Score",102.5000000,1.0000000,0.3590000,0.9120108,NO,1.0999999799921E-9,
FDEKSSTGQYLDK,ub,K,87,true,"upl3 mutant / wildtype",168,35926874,"MaxQuant score",97.6900000,1.0000000,-1.2175914,0.2540800,NO,2.0859099095105E-5,-0.3131000
FDEKSSTGQYLDK,ph,S,88,true,"Tissue atlas Arabidopsis - ProteomicsDB",114,32188942,"MaxQuant score",207.0500000,0.9918360,,,,1.2156900367521E-38,
FDEKSSTGQYLDK,ph,S,89,true,"atm and atr DNA damage response",88,25561503,"MASCOT Score",33.0000000,0.9960000,,,,,-2.1300000
FDEKSSTGQYLDK,ph,S,89,true,"Tissue atlas Arabidopsis - ProteomicsDB",114,32188942,"MaxQuant score",139.4900000,0.9752150,,,,1.697240077192E-5,
SSTGQYLDK,ph,S,89,true,"atm and atr DNA damage response",88,25561503,"MASCOT Score",44.0000000,0.8930000,,,,,-0.6700000
SSTGQYLDK,ph,T,90,true,"atm and atr DNA damage response",88,25561503,"MASCOT Score",32.0000000,0.9430000,,,,,-1.7400000
SSTGQYLDK,ph,T,90,true,"Tissue atlas Arabidopsis - ProteomicsDB",114,32188942,"MaxQuant score",89.8310000,0.9998350,,,,4.2346200643806E-5,
SSTGQYLDKAEK,ac,K,96,true,"Histone deacetylases substrates - hda14 vs WT",98e,29061669,"MaxQuant Score",79.9000000,1.0000000,0.2770000,0.9120108,NO,3.4000000596279E-5,
SSTGQYLDKAEK,ac,K,96,true,"Quantitative Acetylproteomics",101,29440448,,,,,,,,
YLNDYESSHSTGAGGPPPPTSQAEPASQPEPAAK,ph,S,106,true,"Lateral root-induction - NAA vs control",106,23328941,"MASCOT Score",21.0000000,,,,,,
YLNDYESSHSTGAGGPPPPTSQAEPASQPEPAAK,ph,S,126,true,"Tissue atlas Arabidopsis - ProteomicsDB",114,32188942,"MaxQuant score",41.3260000,0.8616550,,,,0.00029284800984897,
KDDEESGGGLGGYAK,cr,K,134,true,"Open search Plant PTM Viewer 2.0 - Crotonylation",164c,TBA,,,,,,,,
KDDEESGGGLGGYAK,ub,K,134,true,"upl3 mutant / wildtype",168,35926874,"MaxQuant score",195.6000000,1.0000000,-0.1093588,,,4.6292699367699E-29,0.3887600
KDDEESGGGLGGYAK,ph,S,139,true,"STN8 phosphoproteome",38,21768351,"MASCOT Score",94.9600000,,,,,,-1.3144800
KDDEESGGGLGGYAK,ph,S,139,true,"Chloroplast kinase substrates",60,19376835,"MASCOT Score",83.6400000,,,,,,-0.7772750
KDDEESGGGLGGYAK,ph,S,139,true,"srk2dei ABA signaling phopshoproteomics",83,23572148,"MASCOT Score",77.0000000,,,,,,-0.0006000
KDDEESGGGLGGYAK,ph,S,139,true,"LAXIC - mannitol vs control",84b,23660473,XCorr,3.1400000,1.0000000,,,,0.17014999687672,
KDDEESGGGLGGYAK,ph,S,139,true,"atm and atr DNA damage response",88,25561503,"MASCOT Score",87.0000000,1.0000000,,,,,-0.5900000
KDDEESGGGLGGYAK,ph,S,139,true,"Protein sumoylation and phosphorylation cross-talk",97,28419593,,,,,,,,
KDDEESGGGLGGYAK,ph,S,139,true,"TOR Kinase and ABA Receptor",100,29290610,XCorr,4.0567050,0.9958000,,,,4.1240000427933E-5,
KDDEESGGGLGGYAK,ph,S,139,true,"Tissue atlas Arabidopsis - ProteomicsDB",114,32188942,"MaxQuant score",284.2300000,1.0000000,,,,0,
KDDEESGGGLGGYAK,ac,K,148,true,"Quantitative Acetylproteomics",101,29440448,,,,,,,,
