Peptide,PTM,ModifiedAA,ModifiedPosition,PeptideUniqueToGene,ExperimentDesc,ExpID,PubmedID,ScoreType,IdentScore,LocProb,Log2FChange,PQ-val,QuantSig,PEP,MassErrorPPM
AAVQQQQAMQ,nt,A,2,true,"N-term acetylation drought responses",5,26184543,,,,,,,,
AAVQQQQAMQKNTLYVGGLADEVNE,nta,A,2,true,"Arabidopsis translation initiation landscape - NTA",167a,35069635,,,,,,,,
AAVQQQQAMQK,nta,A,2,true,"Characterization plant N-terminal acetylation",6,22223895,"MASCOT Score",63.7300000,,,,,,
AAVQQQQAMQ,nta,A,2,true,"N-term acetylation drought responses",5,26184543,,,,,,,,
AEADALSHGDA,ph,S,173,true,"atm and atr DNA damage response",88,25561503,"MASCOT Score",45.0000000,1.0000000,,,,,0.0500000
AEADALSHGDA,ph,S,173,true,"Lateral root-induction - NAA vs control",106,23328941,"MASCOT Score",20.0000000,,,,,,
AEADALSHGDA,ph,S,173,true,"Phospho cell culture sucrose/TOR",109,30833711,,,1.0000000,,,,,
AEADALSHGDA,ph,S,173,true,"Tissue atlas Arabidopsis - ProteomicsDB",114,32188942,"MaxQuant score",169.6500000,1.0000000,,,,1.5029899200214E-11,
