Peptide,PTM,ModifiedAA,ModifiedPosition,PeptideUniqueToGene,ExperimentDesc,ExpID,PubmedID,ScoreType,IdentScore,LocProb,Log2FChange,PQ-val,QuantSig,PEP,MassErrorPPM
SNFQEDHSHIGGPGFSR,ph,S,29,true,"atm and atr DNA damage response",88,25561503,"MASCOT Score",41.0000000,1.0000000,,,,,0.8200000
SNFQEDHSHIGGPGFSR,ph,S,29,true,"TOR Kinase and ABA Receptor",100,29290610,XCorr,3.3686767,0.9615000,,,,0.00020860000222456,
SNFQEDHSHIGGPGFSR,ph,S,29,true,"Tissue atlas Arabidopsis - ProteomicsDB",114,32188942,"MaxQuant score",196.9500000,1.0000000,,,,5.8129643806047E-40,
GADNVMFE,nt,G,615,false,"Arg/N-end rule seed, prt6 vs. Wt",99,29168982,"MASCOT Score",45.0600000,,-1.0972036,0.1469054,NO,0.045790001749992,-0.2942861
EVDENEYIEFSKNFNEAK,ub,K,667,true,"Ubiquitination Membrane Proteins",120,33585938,,,,,,,,
EVDENEYIEFSKNFNEAK,ub,K,667,true,"upl3 mutant / wildtype",168,35926874,"MaxQuant score",179.1400000,1.0000000,0.1056781,0.0362970,YES,1.9394200644941E-32,-1.9380000
SIRPTTVGFTAR,ph,S,1170,false,"atm and atr DNA damage response",88,25561503,"MASCOT Score",39.0000000,1.0000000,,,,,0.8900000
SGRFHDQLNK,ph,S,1189,true,"Tissue atlas Arabidopsis - ProteomicsDB",114,32188942,"MaxQuant score",66.7080000,1.0000000,,,,0.0022231200709939,
