Peptide,PTM,ModifiedAA,ModifiedPosition,PeptideUniqueToGene,ExperimentDesc,ExpID,PubmedID,ScoreType,IdentScore,LocProb,Log2FChange,PQ-val,QuantSig,PEP,MassErrorPPM
TEENDYGGNQKILH,nt,T,2,true,"Arg/N-end rule seed, prt6 vs. Wt",99,29168982,"MASCOT Score",46.1100000,,,,,0.0092430002987385,-1.6222671
TEENDYGGNQKILH,nta,T,2,true,"Arg/N-end rule seed, prt6 vs. Wt",99,29168982,"MASCOT Score",46.1100000,,-0.1525900,0.7408679,NO,0.0092430002987385,-1.6222671
TEENDYGGNQK,nta,T,2,true,"Characterization plant N-terminal acetylation",6,22223895,"MASCOT Score",54.6100000,,,,,,
TEENDYGGNQK,ph,T,2,true,"atm and atr DNA damage response",88,25561503,"MASCOT Score",63.0000000,1.0000000,,,,,-0.2900000
MGIVSGGTVEGK,ph,S,86,true,"Tissue atlas Arabidopsis - ProteomicsDB",114,32188942,"MaxQuant score",83.3580000,0.9325690,,,,0.00071849999949336,
SDVYPQASSFGAK,ph,S,118,true,"Tissue atlas Arabidopsis - ProteomicsDB",114,32188942,"MaxQuant score",77.1920000,0.7778830,,,,0.0012841100106016,
SDVYPQASSFGAKGLNIDIQSNK,ac,K,122,true,"Histone deacetylases - apicidin vs control",98a,29061669,"MaxQuant Score",118.5000000,1.0000000,1.3390000,0.0051642,YES,7.1999999000293E-35,
ACVVAFASPETLK,ph,S,279,true,"Tissue atlas Arabidopsis - ProteomicsDB",114,32188942,"MaxQuant score",115.0600000,0.9448380,,,,9.3398703029379E-5,
DWSENSGDRR,ph,S,505,true,"atm and atr DNA damage response",88,25561503,"MASCOT Score",36.0000000,1.0000000,,,,,0.0300000
DWSENSGDRR,ph,S,505,true,"Tissue atlas Arabidopsis - ProteomicsDB",114,32188942,"MaxQuant score",122.1800000,1.0000000,,,,9.430070349481E-5,
ATTERDWSENSGDRR,ph,S,508,true,"TOR Kinase and ABA Receptor",100,29290610,XCorr,2.3261533,0.9924000,,,,0.099140003323555,
DWSENSGDRR,ph,S,508,true,"atm and atr DNA damage response",88,25561503,"MASCOT Score",42.0000000,1.0000000,,,,,-0.2100000
DWSENSGDRR,ph,S,508,true,"Tissue atlas Arabidopsis - ProteomicsDB",114,32188942,"MaxQuant score",240.5100000,1.0000000,,,,0,
DRDSDEFDRGQSSLK,ph,S,534,true,"srk2dei ABA signaling phopshoproteomics",83,23572148,"MASCOT Score",37.0000000,,,,,,0.0004000
DRDSDEFDRGQSSLK,ph,S,534,true,"TOR Kinase and ABA Receptor",100,29290610,XCorr,3.3227961,0.9996000,,,,0.0072539998218417,
DRDSDEFDRGQSSLK,ph,S,534,true,"Tissue atlas Arabidopsis - ProteomicsDB",114,32188942,"MaxQuant score",197.8500000,1.0000000,,,,5.1360499292888E-35,
DRDSDEFDR,ph,S,534,true,"atm and atr DNA damage response",88,25561503,"MASCOT Score",39.0000000,1.0000000,,,,,0.3800000
DRDSDEFDR,ph,S,534,true,"Phospho cell culture sucrose/TOR",109,30833711,,,1.0000000,,,,,
DRDSDEFDRGQSSLK,ph,S,542,true,"Tissue atlas Arabidopsis - ProteomicsDB",114,32188942,"MaxQuant score",55.5750000,0.8921270,,,,0.0013026000233367,
SRMSEDDHR,ph,S,553,true,"atm and atr DNA damage response",88,25561503,"MASCOT Score",26.0000000,1.0000000,,,,,0.1500000
SRMSEDDHR,ph,S,553,true,"Tissue atlas Arabidopsis - ProteomicsDB",114,32188942,"MaxQuant score",71.8060000,0.9942230,,,,0.0020047700963914,
