Peptide,PTM,ModifiedAA,ModifiedPosition,PeptideUniqueToGene,ExperimentDesc,ExpID,PubmedID,ScoreType,IdentScore,LocProb,Log2FChange,PQ-val,QuantSig,PEP,MassErrorPPM
HASKPSFSTQASWISQDQLER,ph,S,49,true,"Tissue atlas Arabidopsis - ProteomicsDB",114,32188942,"MaxQuant score",133.4600000,0.9999280,,,,1.2530999943628E-22,
LSSEVVDDVNLDGK,ph,S,61,true,"Tissue atlas Arabidopsis - ProteomicsDB",114,32188942,"MaxQuant score",180.8500000,0.9999220,,,,1.1698500515308E-22,
KASCGSSNR,ph,S,160,true,"atm and atr DNA damage response",88,25561503,"MASCOT Score",22.0000000,1.0000000,,,,,-0.8300000
VASGDILPSEDAVVSTEK,ph,S,236,true,"srk2dei ABA signaling phopshoproteomics",83,23572148,"MASCOT Score",51.0000000,,,,,,0.0022000
VASGDILPSEDAVVSTEK,ph,S,236,true,"LAXIC - ABA stress",84a,23660473,XCorr,3.9300000,1.0000000,,,,1.8299999737792E-6,
VASGDILPSEDAVVSTEK,ph,S,236,true,"SnRK2 protein kinase substrates",85,23776212,XCorr,2.5671692,1.0000000,,,,4.8597201384837E-5,
VASGDILPSEDAVVSTEK,ph,S,236,true,"TOR Kinase and ABA Receptor",100,29290610,XCorr,3.6475632,1.0000000,,,,4.5869999354409E-8,
VASGDILPSEDAVVSTEK,ph,S,236,true,"Phospho cell culture sucrose/TOR",109,30833711,,,0.9999990,,,,,
VASGDILPSEDAVVSTEK,ph,S,236,true,"Tissue atlas Arabidopsis - ProteomicsDB",114,32188942,"MaxQuant score",158.6500000,1.0000000,,,,1.7805500913214E-21,
DPFFSDRLQIPAR,ph,S,401,true,"TOR Kinase and ABA Receptor",100,29290610,XCorr,3.0826397,1.0000000,,,,0.0086209997534752,
DPFFSDR,ph,S,401,true,"Tissue atlas Arabidopsis - ProteomicsDB",114,32188942,"MaxQuant score",117.2200000,1.0000000,,,,6.3823401168614E-22,
NSLSSSSSSTFL,ph,S,811,true,"atm and atr DNA damage response",88,25561503,"MASCOT Score",36.0000000,0.8740000,,,,,-0.3400000
NSLSSSSSSTFL,ph,S,812,true,"atm and atr DNA damage response",88,25561503,"MASCOT Score",39.0000000,0.8500000,,,,,-0.5000000
NSLSSSSSSTFL,ph,S,813,true,"atm and atr DNA damage response",88,25561503,"MASCOT Score",32.0000000,0.7960000,,,,,-0.4200000
NSLSSSSSSTFL,ph,T,814,true,"atm and atr DNA damage response",88,25561503,"MASCOT Score",35.0000000,0.9980000,,,,,0.0000000
