Peptide,PTM,ModifiedAA,ModifiedPosition,PeptideUniqueToGene,ExperimentDesc,ExpID,PubmedID,ScoreType,IdentScore,LocProb,Log2FChange,PQ-val,QuantSig,PEP,MassErrorPPM
GTSSDPIQDGSDEQQKR,nt,G,2,true,"Arg/N-end rule pathway Roots",80,25728785,"MASCOT Score",49.1600000,,,,,2.79000005321E-6,
GTSSDPIQDGSDEQQKR,nt,G,2,true,"Arg/N-end rule seed, prt6 vs. Wt",99,29168982,"MASCOT Score",55.0100000,,-0.0367768,0.7900462,NO,0.0062130000442266,-2.1613669
GTSSDPIQDGSDEQQKR,nt,G,2,true,"Arabidopsis translation initiation landscape - NT",167b,35069635,,,,,,,,
GTSSDPIQD,nt,G,2,true,"Arg/N-end rule seed, prt6 vs. Wt",99,29168982,"MASCOT Score",47.6400000,,-0.2797835,0.6493199,NO,0.0027550000231713,-1.4019216
GTSSDPIQDGSDEQQKR,nta,G,2,true,"Arg/N-end rule seed, prt6 vs. Wt",99,29168982,"MASCOT Score",55.0100000,,-0.3129706,0.4818606,NO,0.0062130000442266,-2.1613669
GTSSDPIQDGSDEQQKR,ph,T,3,true,"Tissue atlas Arabidopsis - ProteomicsDB",114,32188942,"MaxQuant score",204.5200000,0.8505780,,,,0,
GTSSDPIQDGSDEQQK,ph,T,3,true,"Lateral root-induction - NAA vs control",106,23328941,"MASCOT Score",65.0000000,,,,,,
GTSSDPIQDGSDEQQKR,ph,S,4,true,"Tissue atlas Arabidopsis - ProteomicsDB",114,32188942,"MaxQuant score",200.6900000,0.9912150,,,,2.5807573687624E-40,
GTSSDPIQDGSDEQQK,ph,S,4,true,"atm and atr DNA damage response",88,25561503,"MASCOT Score",48.0000000,0.9890000,,,,,-0.8400000
GTSSDPIQDGSDEQQKR,ph,S,5,true,"Tissue atlas Arabidopsis - ProteomicsDB",114,32188942,"MaxQuant score",275.4200000,0.9999780,,,,0,
GTSSDPIQDGSDEQQK,ph,S,5,true,"Conserved plant phosphoproteome - Arabidopsis",61a,20466843,"MASCOT Score",21.0000000,1.0000000,,,,,
GTSSDPIQDGSDEQQK,ph,S,5,true,"atm and atr DNA damage response",88,25561503,"MASCOT Score",69.0000000,0.8580000,,,,,-0.3800000
GTSSDPIQDGSDEQQK,ph,S,5,true,"Lateral root-induction - NAA vs control",106,23328941,"MASCOT Score",25.0000000,,,,,,
GTSSDPIQDGSDEQQKR,ph,S,12,true,"Tissue atlas Arabidopsis - ProteomicsDB",114,32188942,"MaxQuant score",176.1100000,1.0000000,,,,6.0192396853094E-23,
