Peptide,PTM,ModifiedAA,ModifiedPosition,PeptideUniqueToGene,ExperimentDesc,ExpID,PubmedID,ScoreType,IdentScore,LocProb,Log2FChange,PQ-val,QuantSig,PEP,MassErrorPPM
KIKVAINGFGR,nt,K,64,true,"N-terminal ChaFRADIC",92,26010716,"MASCOT Score",23.0900000,,,,,0.00016450000111945,
KIKVAINGFGR,nt,K,64,true,"Stromal N-terminome",96,26371235,"MASCOT Score",50.4600000,,,,,,
KIKVAINGFGR,nt,K,64,true,"Arabidopsis translation initiation landscape - NT",167b,35069635,,,,,,,,
IKVAINGFGR,ac,K,66,true,"Quantitative Acetylproteomics",101,29440448,,,,,,,,
CWHGRK,so,C,82,false,"S-sulfenylation site detection using YAP1C",110,32714340,,,,,,,,
IIKIVSDR,ac,K,138,true,"Histone deacetylases - apicidin vs control",98a,29061669,"MaxQuant Score",136.6000000,1.0000000,0.0110000,0.9727472,NO,0.00022000000171829,
IIKIVSDR,ac,K,138,true,"Histone deacetylases substrates - hda14 vs WT",98e,29061669,"MaxQuant Score",85.7000000,1.0000000,-0.0870000,0.9120108,NO,0.0040000001899898,
SDRNPSNLPWGEL,nt,S,141,true,"N-terminal ChaFRADIC",92,26010716,"MASCOT Score",23.6700000,,,,,0.052200000733137,
DGAGKHLQAGAK,ac,K,173,true,"Quantitative Acetylproteomics",101,29440448,,,,,,,,
HLQAGAKK,ac,K,180,true,"Quantitative Acetylproteomics",101,29440448,,,,,,,,
QKFGIIKGTMTTTHSYTGDQRLLD,nt,Q,230,false,"HUNTER N-terminome: legumain, GluC and trypsin",119,31951383,"MaxQuant score",,,,,,,
VLDQKFGIIK,ac,K,231,false,"Histone deacetylases - apicidin vs control",98a,29061669,"MaxQuant Score",122.7000000,1.0000000,0.1260000,0.4405549,NO,3.4000000592727E-9,
VLDQKFGIIK,ac,K,231,false,"Histone deacetylases substrates - TSA vs control",98b,29061669,"MaxQuant Score",122.7000000,1.0000000,0.0040000,0.9977001,NO,3.4000000592727E-9,
VLDQKFGIIK,ac,K,231,false,"Histone deacetylases- hda14 vs WT (low light)",98c,29061669,"MaxQuant Score",110.0800000,1.0000000,-0.3920000,0.9885531,NO,0.0040000001899898,
VLDQKFGIIK,ac,K,231,false,"Quantitative Acetylproteomics",101,29440448,,,,,,,,
VLDQKFGIIK,cr,K,231,false,"Open search Plant PTM Viewer 2.0 - Crotonylation",164c,TBA,,,,,,,,
VLDQKFGIIK,pgk,K,231,false,"Open search Plant PTM Viewer 2.0 - 3pgK",164f,TBA,,,,,,,,
FGIIKGTMTTTHSYTGDQR,ac,K,236,false,"Histone deacetylases- hda14 vs WT (low light)",98c,29061669,"MaxQuant Score",46.3500000,1.0000000,0.2530000,0.9885531,NO,0.019999999552965,
FGIIKGTMTTTHSYTGDQR,hib,K,236,false,"Open search Plant PTM Viewer 2.0 - hib",164e,TBA,,,,,,,,
FGIIKGTMTTTHSYTGDQR,pgk,K,236,false,"Open search Plant PTM Viewer 2.0 - 3pgK",164f,TBA,,,,,,,,
SYTGDQRLLD,nt,S,244,false,"HUNTER N-terminome: legumain, GluC and trypsin",119,31951383,"MaxQuant score",79.1480000,,,,,,
GTMTTTHSYTGDQR,ph,T,246,false,"atm and atr DNA damage response",88,25561503,"MASCOT Score",80.0000000,0.9920000,,,,,-0.5300000
GTMTTTHSYTGDQR,ph,T,246,false,"Tissue atlas Arabidopsis - ProteomicsDB",114,32188942,"MaxQuant score",88.2640000,0.9806690,,,,0.00013817500439472,
AAALNIVPTSTGAAK,ph,T,272,false,"srk2dei ABA signaling phopshoproteomics",83,23572148,"MASCOT Score",23.0000000,,,,,,0.0000000
AAALNIVPTSTGAAK,ph,S,273,false,"Tissue atlas Arabidopsis - ProteomicsDB",114,32188942,"MaxQuant score",172.5700000,0.8044420,,,,1.5605900456336E-17,
AAALNIVPTSTGAAK,ph,T,274,false,"srk2dei ABA signaling phopshoproteomics",83,23572148,"MASCOT Score",26.0000000,,,,,,0.0010000
AAALNIVPTSTGAAK,ph,T,274,false,"atm and atr DNA damage response",88,25561503,"MASCOT Score",30.0000000,1.0000000,,,,,-1.3900000
AAALNIVPTSTGAAK,ac,K,278,false,"Quantitative Acetylproteomics",101,29440448,,,,,,,,
AVALVLPNLKGK,ac,K,288,false,"Histone deacetylases- hda14 vs WT (low light)",98c,29061669,"MaxQuant Score",125.7500000,1.0000000,0.3040000,0.9931160,NO,1.0999999631167E-6,
AVALVLPNLKGK,ac,K,288,false,"Quantitative Acetylproteomics",101,29440448,,,,,,,,
AVALVLPNLK,ac,K,288,false,"Quantitative Acetylproteomics",101,29440448,,,,,,,,
AVALVLPNLKGK,cr,K,288,false,"Open search Plant PTM Viewer 2.0 - Crotonylation",164c,TBA,,,,,,,,
AVALVLPNLKGK,hib,K,288,false,"Open search Plant PTM Viewer 2.0 - hib",164e,TBA,,,,,,,,
AVALVLPNLKGK,pgk,K,288,false,"Open search Plant PTM Viewer 2.0 - 3pgK",164f,TBA,,,,,,,,
GKLNGIALR,ac,K,290,false,"Histone deacetylases - apicidin vs control",98a,29061669,"MaxQuant Score",118.7000000,1.0000000,-0.1300000,0.5457579,NO,0.00022000000171829,
GKLNGIALR,ac,K,290,false,"Histone deacetylases- hda14 vs WT (low light)",98c,29061669,"MaxQuant Score",136.5700000,1.0000000,-0.9530000,0.9549926,NO,0.0080000003799796,
VPTPNVSVVDLVVQVSKK,ph,S,313,false,"Tissue atlas Arabidopsis - ProteomicsDB",114,32188942,"MaxQuant score",98.2670000,1.0000000,,,,4.7980500994527E-7,
LNGIALRVPTPNVSVVDLVVQVSKK,ac,K,314,false,"Lysine acetylation gel-based Finkemeier et al",37,21311031,i-probability,0.9518640,,,,,,
KTFAEEVNAAFR,ac,K,315,false,"Histone deacetylases - apicidin vs control",98a,29061669,"MaxQuant Score",106.1000000,1.0000000,-0.0160000,0.9397233,NO,0.00052000000141561,
KTFAEEVNAAFR,cr,K,315,false,"Open search Plant PTM Viewer 2.0 - Crotonylation",164c,TBA,,,,,,,,
TFAEEVNAAFR,nt,T,316,false,"Stromal N-terminome",96,26371235,"MASCOT Score",70.1700000,,,,,,
DAAEKELK,ac,K,331,true,"Histone deacetylases - apicidin vs control",98a,29061669,"MaxQuant Score",145.9000000,1.0000000,0.0430000,0.8109611,NO,1.9999999949505E-6,
DAAEKELK,ac,K,331,true,"Histone deacetylases substrates - hda14 vs WT",98e,29061669,"MaxQuant Score",134.3000000,1.0000000,-0.0920000,0.9120108,NO,2.3999999036739E-12,
DAAEKELK,ac,K,331,true,"Quantitative Acetylproteomics",101,29440448,,,,,,,,
GILDVCDEPLVSVDFR,sno,C,340,false,"Cold stress nitrosylation - 4°C vs 22°C",65,24388526,,,,1.3219281,,NO,,
GILDVCDEPLVSVDFR,sno,C,340,false,"Site-specific nitrosomeproteomic id - gsnor1-3",90a,25699590,XCorr,4.1500000,,,,,9.9999999392253E-9,-5.6900000
GILDVCDEPLVSVDFR,sno,C,340,false,"Site-specific nitrosomeproteomic id - gsnor1-3",90b,25699590,XCorr,4.6900000,,,,,0.0044289999641478,-7.3300000
GILDVCDEPLVSVDFR,sno,C,340,false,"hot5-4 / wildtype, FAT-switch S-nitrosoproteome",169,37277371,,,,-0.6287761,0.0509931,NO,,
GILDVCDEPLVSVDFR,so,C,340,false,"S-sulfenylation site detection using YAP1C",110,32714340,,,,,,,,
DEPLVSVDFR,nt,D,341,false,"Arg/N-end rule seed, prt6 vs. Wt",99,29168982,"MASCOT Score",49.4500000,,-0.2425894,0.0825579,NO,0.0061160000041127,-1.8479614
VVDLADIVANNWK,nt,V,387,false,"Stromal N-terminome",96,26371235,"MASCOT Score",90.6400000,,,,,,
VVDLADIVANNWK,ac,K,399,false,"Quantitative Acetylproteomics",101,29440448,,,,,,,,
