Peptide,PTM,ModifiedAA,ModifiedPosition,PeptideUniqueToGene,ExperimentDesc,ExpID,PubmedID,ScoreType,IdentScore,LocProb,Log2FChange,PQ-val,QuantSig,PEP,MassErrorPPM
KQSNAHSTFADINEVEDEAEQELQQQENNNNKR,ph,S,6,true,"Tissue atlas Arabidopsis - ProteomicsDB",114,32188942,"MaxQuant score",263.0100000,0.9946490,,,,0,
QVSLETGFSVLNRESR,ph,T,62,true,"TOR Kinase and ABA Receptor",100,29290610,XCorr,3.0952771,0.9010000,,,,0.017430000007153,
QVSLETGFSVLNRESR,ph,S,71,true,"TOR Kinase and ABA Receptor",100,29290610,XCorr,3.0952771,0.9982000,,,,0.017430000007153,
SFGGFESGGIINGGDGR,ph,S,86,true,"atm and atr DNA damage response",88,25561503,"MASCOT Score",54.0000000,1.0000000,,,,,-0.1600000
SFGGFESGGIINGGDGR,ph,S,86,true,"Tissue atlas Arabidopsis - ProteomicsDB",114,32188942,"MaxQuant score",83.4040000,0.9999870,,,,0.00019633700139821,
QKSLLPSIIR,ph,S,120,true,"atm and atr DNA damage response",88,25561503,"MASCOT Score",26.0000000,1.0000000,,,,,-0.0300000
QKSLLPSIIR,ph,S,120,true,"Tissue atlas Arabidopsis - ProteomicsDB",114,32188942,"MaxQuant score",69.8150000,0.9999840,,,,0.0041605900041759,
TEDGETKDDSINENVSAGR,ph,S,146,true,"Tissue atlas Arabidopsis - ProteomicsDB",114,32188942,"MaxQuant score",66.8530000,0.8130900,,,,0.00011133999942103,
KISAEKDFEAEEESHH,ph,S,543,true,"Tissue atlas Arabidopsis - ProteomicsDB",114,32188942,"MaxQuant score",56.0810000,0.9999880,,,,0.00079473998630419,
DFEAEEESHH,ph,S,554,true,"Tissue atlas Arabidopsis - ProteomicsDB",114,32188942,"MaxQuant score",211.2700000,1.0000000,,,,4.4643800383016E-20,
