Peptide,PTM,ModifiedAA,ModifiedPosition,PeptideUniqueToGene,ExperimentDesc,ExpID,PubmedID,ScoreType,IdentScore,LocProb,Log2FChange,PQ-val,QuantSig,PEP,MassErrorPPM
STTSGTGGVSYR,nt,S,2,true,"Arg/N-end rule seed, prt6 vs. Wt",99,29168982,"MASCOT Score",82.6500000,,,,,0.013960000127554,-0.3520987
STTSGTGGVSYR,nta,S,2,true,"Arg/N-end rule seed, prt6 vs. Wt",99,29168982,"MASCOT Score",82.6500000,,,,,0.013960000127554,-0.3520987
KSSPAALGGGSSK,ph,S,47,true,"atm and atr DNA damage response",88,25561503,"MASCOT Score",42.0000000,0.9980000,,,,,-3.1100000
SSPAALGGGSSK,ph,S,47,true,"atm and atr DNA damage response",88,25561503,"MASCOT Score",88.0000000,0.9550000,,,,,-0.3100000
SSPAALGGGSSK,ph,S,47,true,"Tissue atlas Arabidopsis - ProteomicsDB",114,32188942,"MaxQuant score",93.6490000,0.7795890,,,,0.0002385760017205,
INKSGSEGHTLEEAK,ph,S,328,true,"Tissue atlas Arabidopsis - ProteomicsDB",114,32188942,"MaxQuant score",122.8300000,0.9403930,,,,7.8352098853429E-7,
DSFGGTAR,ph,S,376,false,"atm and atr DNA damage response",88,25561503,"MASCOT Score",31.0000000,1.0000000,,,,,-4.4600000
DSFGGTAR,ph,T,380,false,"atm and atr DNA damage response",88,25561503,"MASCOT Score",31.0000000,1.0000000,,,,,-4.4600000
TLTSSPTFLTELRR,ph,T,906,true,"Tissue atlas Arabidopsis - ProteomicsDB",114,32188942,"MaxQuant score",64.2750000,0.7627360,,,,0.00064832897624001,
