Peptide,PTM,ModifiedAA,ModifiedPosition,PeptideUniqueToGene,ExperimentDesc,ExpID,PubmedID,ScoreType,IdentScore,LocProb,Log2FChange,PQ-val,QuantSig,PEP,MassErrorPPM
SYSDSDSSSHGGEYKNFR,nt,S,2,true,"Arg/N-end rule seed, prt6 vs. Wt",99,29168982,"MASCOT Score",59.1400000,,,,,0.0023980000987649,-1.5095715
SYSDSDSSSHGGEYKNFR,nta,S,2,true,"Arg/N-end rule pathway Roots",80,25728785,"MASCOT Score",49.5400000,,,,,0.0066920001991093,
SYSDSDSSSHGGEYKNFR,nta,S,2,true,"Arg/N-end rule seed, prt6 vs. Wt",99,29168982,"MASCOT Score",59.1400000,,0.3324065,0.1229945,NO,0.0023980000987649,-1.5095715
SYSDSDSSSHGGEYKNFR,nta,S,2,true,"HUNTER N-terminome: legumain, GluC and trypsin",119,31951383,"MaxQuant score",,,,,,,
SYSDSDSSSHGGEYKNFR,nta,S,2,true,"Arabidopsis translation initiation landscape - NTA",167a,35069635,,,,,,,,
SYSDSDSSSHGGEYK,ph,S,2,true,"Tissue atlas Arabidopsis - ProteomicsDB",114,32188942,"MaxQuant score",239.7500000,0.9996030,,,,0,
SYSDSDSSSHGGEYK,ph,S,4,true,"Tissue atlas Arabidopsis - ProteomicsDB",114,32188942,"MaxQuant score",231.1700000,0.9997300,,,,0,
SYSDSDSSSHGGEYK,ph,S,6,true,"Tissue atlas Arabidopsis - ProteomicsDB",114,32188942,"MaxQuant score",198.8700000,0.9654660,,,,2.9942401029899E-35,
SYSDSDSSSHGGEYK,ph,S,8,true,"Tissue atlas Arabidopsis - ProteomicsDB",114,32188942,"MaxQuant score",270.2100000,0.9107600,,,,0,
SYSDSDSSSHGGEYK,ph,S,9,true,"Tissue atlas Arabidopsis - ProteomicsDB",114,32188942,"MaxQuant score",279.2900000,0.8111640,,,,0,
ALEDLFGDEETSR,ph,T,177,true,"Tissue atlas Arabidopsis - ProteomicsDB",114,32188942,"MaxQuant score",207.5200000,0.8931070,,,,1.6594799992351E-38,
ALEDLFGDEETSR,ph,S,178,true,"Large-scale phosphorylation discovery",44,23111157,XCorr,4.3650000,,,,,,
ALEDLFGDEETSR,ph,S,178,true,"LAXIC - mannitol vs control",84b,23660473,XCorr,3.6700000,0.9990000,SINGLETON_UP,0.0000000,YES,3.9899998860449E-9,
SLDASTMTTLR,ph,S,216,true,"Tissue atlas Arabidopsis - ProteomicsDB",114,32188942,"MaxQuant score",111.1200000,0.9017280,,,,3.311409818707E-5,
KNTPGGFTLK,ph,T,484,true,"Tissue atlas Arabidopsis - ProteomicsDB",114,32188942,"MaxQuant score",186.7600000,1.0000000,,,,8.7495299894158E-10,
QEEAAWQLSR,nt,Q,506,true,"HUNTER N-terminome: legumain, GluC and trypsin",119,31951383,"MaxQuant score",68.8930000,,,,,,
TPTWAKPRGSDDGYSSDSVLR,ph,S,582,true,"Arabidopsis root NAA phosphoproteome",18a,27643528,"MaxQuant Score",64.2700000,0.7620000,,,,9.3210001068655E-6,0.0250000
PRGSDDGYSSDSVLR,ph,S,582,true,"atm and atr DNA damage response",88,25561503,"MASCOT Score",64.0000000,1.0000000,,,,,-0.6500000
PRGSDDGYSSDSVLR,ph,S,582,true,"Tissue atlas Arabidopsis - ProteomicsDB",114,32188942,"MaxQuant score",257.9500000,1.0000000,,,,0,
GSDDGYSSDSVLR,ph,S,582,true,"STN8 phosphoproteome",38,21768351,"MASCOT Score",79.6800000,,,,,,-1.0019600
GSDDGYSSDSVLR,ph,S,582,true,"Tyrosine phosphorylation in Arabidopsis",59,18463617,"MASCOT Score",39.0000000,,,,,,-0.9745610
GSDDGYSSDSVLR,ph,S,582,true,"LAXIC - mannitol vs control",84b,23660473,XCorr,3.9000000,0.9980000,SINGLETON_UP,0.0000000,YES,0.029941299930215,
GSDDGYSSDSVLR,ph,S,582,true,"atm and atr DNA damage response",88,25561503,"MASCOT Score",77.0000000,1.0000000,,,,,0.3900000
GSDDGYSSDSVLR,ph,S,582,true,"Lateral root-induction - NAA vs control",106,23328941,"MASCOT Score",41.0000000,,,,,,
GSDDGYSSDSVLR,ph,S,582,true,"Phospho cell culture sucrose/TOR",109,30833711,,,1.0000000,,,,,
GSDDGYSSDSVLR,ph,S,582,true,"Col-0 callus - FC Col-0 vs. Col-0 Xray",111a,31410901,,77.4000000,,0.9720637,0.0000000,NO,,0.6225968
GSDDGYSSDSVLR,ph,S,582,true,"Col-0 X-ray callus - FC Col-0 vs. Col-0 Xray",111b,31410901,,77.4000000,,0.9720637,0.0000000,NO,,0.6225968
GSDDGYSSDSVLR,ph,S,582,true,"atm callus - FC atm vs. atm Xray",111c,31410901,,77.4000000,,-0.5440613,0.0000000,NO,,0.6225968
GSDDGYSSDSVLR,ph,S,582,true,"atm-3 X-ray callus - FC atm vs. atm Xray",111d,31410901,,77.4000000,,-0.5440613,0.0000000,NO,,0.6225968
GSDDGYSSDSVLR,ph,S,582,true,"Touch-induced phosphorylation: 40s touch vs untouc",136,30291188,"MASCOT score",81.6800000,,0.0323781,0.8049565,NO,,3.7014204
GSDDGYSSDSVLR,ph,Y,586,true,"atm and atr DNA damage response",88,25561503,"MASCOT Score",24.0000000,0.9480000,,,,,-2.5900000
GSDDGYSSDSVLR,ph,Y,586,true,"Lateral root-induction - NAA vs control",106,23328941,"MASCOT Score",24.0000000,,,,,,
PRGSDDGYSSDSVLR,ph,S,587,true,"atm and atr DNA damage response",88,25561503,"MASCOT Score",25.0000000,0.8750000,,,,,-0.7500000
PRGSDDGYSSDSVLR,ph,S,587,true,"Tissue atlas Arabidopsis - ProteomicsDB",114,32188942,"MaxQuant score",182.7200000,0.8520530,,,,6.9165900433617E-22,
GSDDGYSSDSVLR,ph,S,587,true,"atm and atr DNA damage response",88,25561503,"MASCOT Score",51.0000000,0.9910000,,,,,-0.0100000
PRGSDDGYSSDSVLR,ph,S,588,true,"atm and atr DNA damage response",88,25561503,"MASCOT Score",48.0000000,1.0000000,,,,,-0.3200000
GSDDGYSSDSVLR,ph,S,588,true,"Large-scale phosphorylation discovery",44,23111157,XCorr,3.9710000,,,,,,
GSDDGYSSDSVLR,ph,S,588,true,"Tyrosine phosphorylation in Arabidopsis",59,18463617,"MASCOT Score",69.0000000,,,,,,-0.2784458
GSDDGYSSDSVLR,ph,S,588,true,"srk2dei ABA signaling phopshoproteomics",83,23572148,"MASCOT Score",74.0000000,,,,,,-0.0003000
GSDDGYSSDSVLR,ph,S,588,true,"LAXIC - ABA stress",84a,23660473,XCorr,3.4800000,0.9690000,,,,3.8199999835342E-5,
GSDDGYSSDSVLR,ph,S,588,true,"LAXIC - mannitol vs control",84b,23660473,XCorr,3.4700000,0.9560000,SINGLETON_UP,0.0000000,YES,2.9099999210302E-7,
GSDDGYSSDSVLR,ph,S,588,true,"SnRK2 protein kinase substrates",85,23776212,XCorr,2.8833447,0.9690000,,,,0.0018280199728906,
GSDDGYSSDSVLR,ph,S,588,true,"atm and atr DNA damage response",88,25561503,"MASCOT Score",47.0000000,0.9530000,,,,,0.2300000
GSDDGYSSDSVLR,ph,S,588,true,"Lateral root-induction - NAA vs control",106,23328941,"MASCOT Score",53.0000000,,,,,,
GSDDGYSSDSVLR,ph,S,588,true,"Phospho cell culture sucrose/TOR",109,30833711,,,0.9139530,,,,,
GSDDGYSSDSVLR,ph,S,588,true,"Col-0 callus - FC Col-0 vs. Col-0 Xray",111a,31410901,,72.7600000,,1.1074856,0.0000000,NO,,0.3643210
GSDDGYSSDSVLR,ph,S,588,true,"Col-0 X-ray callus - FC Col-0 vs. Col-0 Xray",111b,31410901,,72.7600000,,1.1074856,0.0000000,NO,,0.3643210
GSDDGYSSDSVLR,ph,S,588,true,"atm callus - FC atm vs. atm Xray",111c,31410901,,72.7600000,,-0.7517017,0.0000000,NO,,0.3643210
GSDDGYSSDSVLR,ph,S,588,true,"atm-3 X-ray callus - FC atm vs. atm Xray",111d,31410901,,72.7600000,,-0.7517017,0.0000000,NO,,0.3643210
GSDDGYSSDSVLR,ph,S,588,true,"Tissue atlas Arabidopsis - ProteomicsDB",114,32188942,"MaxQuant score",199.1300000,0.9937600,,,,1.3802789873599E-42,
GSDDGYSSDSVLR,ph,S,590,true,"srk2dei ABA signaling phopshoproteomics",83,23572148,"MASCOT Score",39.0000000,,,,,,-0.0001000
HASSDFRK,ph,S,596,true,"atm and atr DNA damage response",88,25561503,"MASCOT Score",21.0000000,1.0000000,,,,,-1.5300000
HASSDFRK,ph,S,597,true,"atm and atr DNA damage response",88,25561503,"MASCOT Score",21.0000000,1.0000000,,,,,-1.5300000
