Peptide,PTM,ModifiedAA,ModifiedPosition,PeptideUniqueToGene,ExperimentDesc,ExpID,PubmedID,ScoreType,IdentScore,LocProb,Log2FChange,PQ-val,QuantSig,PEP,MassErrorPPM
ASASSSSSPASSSLE,nt,A,50,true,"Arg/N-end rule seed, prt6 vs. Wt",99,29168982,"MASCOT Score",56.9600000,,0.1091381,0.3606057,NO,8.2470000961621E-7,-4.4894346
SASSSSSPASSSLE,nt,S,51,true,"Arg/N-end rule seed, prt6 vs. Wt",99,29168982,"MASCOT Score",53.9200000,,0.0816580,0.5223165,NO,3.256999889345E-6,-1.6267763
ASSSSSPASSSLE,nt,A,52,true,"Arg/N-end rule seed, prt6 vs. Wt",99,29168982,"MASCOT Score",60.2900000,,-0.2621261,0.0919335,NO,3.9290000131587E-5,-1.4358454
SSSSSPASSSLE,nt,S,53,true,"Arg/N-end rule seed, prt6 vs. Wt",99,29168982,"MASCOT Score",39.5200000,,-0.1978995,0.4218154,NO,0.00070500001311302,-1.7736333
NAVDMALADSSCAGLETTESR,ox,C,129,true,"Bicarbonate Induced Redox Changes - 5 min",117a,28184230,,,,-0.2175914,,YES,,
AGLETTESR,nt,A,130,true,"Arg/N-end rule seed, prt6 vs. Wt",99,29168982,"MASCOT Score",41.6100000,,-0.7072150,0.0155562,NO,0.10300000011921,-0.7254789
LSCFFNK,acy,C,141,true,"Arabidopsis S-acylation atlas - Silique",163e,35681017,,,,,,,,
LSCFFNK,ox,C,141,true,"OxiTRAQ Arabidopsis - 5 mM H2O2 versus control",47,24376095,,,,0.3709575,0.0745066,NO,,
LSCFFNK,ox,C,141,true,"SPEAR - 50 mM H2O2 / mock",138b,34619326,,,,0.8984890,0.0400698,YES,,
NEIDVPHDR,nt,N,189,true,"Arg/N-end rule seed, prt6 vs. Wt",99,29168982,"MASCOT Score",38.2300000,,-1.2968338,0.0122637,YES,0.04228999838233,-0.6714856
SGEDPGLALVKR,ac,K,280,true,"Histone deacetylases - apicidin vs control",98a,29061669,"MaxQuant Score",80.3000000,1.0000000,0.0310000,0.9141132,NO,3.9999998989515E-5,
SGEDPGLALVKR,ac,K,280,true,"Histone deacetylases substrates - hda14 vs WT",98e,29061669,"MaxQuant Score",73.4000000,1.0000000,0.3420000,0.9204496,NO,0.0010000000474975,
SGEDPGLALVKR,ac,K,280,true,"Quantitative Acetylproteomics",101,29440448,,,,,,,,
SYNYIHKYGYK,ac,K,288,true,"Histone deacetylases - apicidin vs control",98a,29061669,"MaxQuant Score",118.9000000,1.0000000,0.2930000,0.2488857,NO,7.4000003223773E-5,
SYNYIHKYGYK,ac,K,288,true,"Histone deacetylases substrates - TSA vs control",98b,29061669,"MaxQuant Score",118.9000000,1.0000000,1.0120000,0.7762471,NO,7.4000003223773E-5,
SYNYIHKYGYK,ac,K,288,true,"Histone deacetylases- hda14 vs WT (low light)",98c,29061669,"MaxQuant Score",59.0400000,1.0000000,0.8930000,0.8491805,NO,0.014000000432134,
SYNYIHKYGYK,ac,K,288,true,"Histone deacetylases substrates - hda14 vs WT",98e,29061669,"MaxQuant Score",57.2000000,1.0000000,0.4550000,0.4216965,NO,0.0020000000949949,
SKLMAAAVR,ac,K,294,true,"Histone deacetylases - apicidin vs control",98a,29061669,"MaxQuant Score",119.5000000,1.0000000,0.0030000,0.9840111,NO,0.00066000001970679,
SKLMAAAVR,ac,K,294,true,"Histone deacetylases substrates - TSA vs control",98b,29061669,"MaxQuant Score",119.5000000,1.0000000,0.0650000,0.9977001,NO,0.00066000001970679,
SKLMAAAVR,ac,K,294,true,"Histone deacetylases- hda14 vs WT (low light)",98c,29061669,"MaxQuant Score",139.4300000,1.0000000,0.0770000,0.9885531,NO,0.00089999998454005,
SKLMAAAVR,ac,K,294,true,"Histone deacetylases - hda14 vs WT (thylakoids)",98d,29061669,"MaxQuant Score",108.5000000,1.0000000,0.1990000,0.8689604,NO,0.0089999996125698,
SKLMAAAVR,ac,K,294,true,"Histone deacetylases substrates - hda14 vs WT",98e,29061669,"MaxQuant Score",143.4000000,1.0000000,0.1930000,0.7516229,NO,8.1000001953151E-19,
SKLMAAAVR,ac,K,294,true,"Quantitative Acetylproteomics",101,29440448,,,,,,,,
