Peptide,PTM,ModifiedAA,ModifiedPosition,PeptideUniqueToGene,ExperimentDesc,ExpID,PubmedID,ScoreType,IdentScore,LocProb,Log2FChange,PQ-val,QuantSig,PEP,MassErrorPPM
APALAVTRDL,nt,A,2,true,"N-term acetylation drought responses",5,26184543,,,,,,,,
APALAVTR,nt,A,2,true,"Arabidopsis translation initiation landscape - NT",167b,35069635,,,,,,,,
PALAVTRDLTAVGSPENAPAKGRASVY,nt,P,3,true,"Arabidopsis translation initiation landscape - NT",167b,35069635,,,,,,,,
DLTAVGSPENAPAKGR,nt,D,10,true,"Metacaspase9 substrates - Col-0 / mc9",51a,23964026,"MASCOT Score",94.0000000,,1.4211136,,NO,,-1.4451501
DLTAVGSPENAPAKGR,nt,D,10,true,"Metacaspase9 substrates - 35S:MC9 / mc9",51b,23964026,"MASCOT Score",46.0000000,,2.0807607,,NO,,-2.1487910
DLTAVGSPENAPAKGR,nt,D,10,true,"Metacaspase9 substrates - in vitro rMC9",51c,23964026,"MASCOT Score",62.0000000,,3.0688323,,NO,,-0.6969062
DLTAVGSPENAPAKGR,nt,D,10,true,"Arg/N-end rule pathway Roots",80,25728785,"MASCOT Score",24.6500000,,,,,0.095830000936985,
DLTAVGSPENAPAKGR,nt,D,10,true,"HUNTER N-terminome: legumain, GluC and trypsin",119,31951383,"MaxQuant score",63.1340000,,,,,,
DLTAVGSPENAPAK,ph,T,12,true,"Tissue atlas Arabidopsis - ProteomicsDB",114,32188942,"MaxQuant score",127.3200000,1.0000000,,,,0.00010201599798165,
DLTAVGSPENAPAKGR,ph,S,16,true,"STN8 phosphoproteome",38,21768351,"MASCOT Score",44.6700000,,,,,,-0.2312070
DLTAVGSPENAPAKGR,ph,S,16,true,"Chloroplast kinase substrates",60,19376835,"MASCOT Score",41.7100000,,,,,,-0.2312070
DLTAVGSPENAPAK,ph,S,16,true,"Arabidopsis root NAA phosphoproteome",18a,27643528,"MaxQuant Score",89.3740000,1.0000000,,,,1.7880000258153E-10,-0.1040000
DLTAVGSPENAPAK,ph,S,16,true,"Phosphorylation nuclei-enriched fractions",28,19245862,,,,,,,,
DLTAVGSPENAPAK,ph,S,16,true,"Tyrosine phosphorylation in Arabidopsis",59,18463617,"MASCOT Score",84.0000000,,,,,,-0.4141775
DLTAVGSPENAPAK,ph,S,16,true,"Chloroplast kinase substrates",60,19376835,"MASCOT Score",72.3000000,,,,,,-0.8040300
DLTAVGSPENAPAK,ph,S,16,true,"srk2dei ABA signaling phopshoproteomics",83,23572148,"MASCOT Score",86.0000000,,,,,,-0.0004000
DLTAVGSPENAPAK,ph,S,16,true,"LAXIC - ABA stress",84a,23660473,XCorr,3.5300000,1.0000000,,,,0.0013901100028306,
DLTAVGSPENAPAK,ph,S,16,true,"SnRK2 protein kinase substrates",85,23776212,XCorr,3.7768936,1.0000000,,,,0.00067857600515708,
DLTAVGSPENAPAK,ph,S,16,true,"atm and atr DNA damage response",88,25561503,"MASCOT Score",71.0000000,1.0000000,,,,,0.1100000
DLTAVGSPENAPAK,ph,S,16,true,"Protein sumoylation and phosphorylation cross-talk",97,28419593,,,,,,,,
DLTAVGSPENAPAK,ph,S,16,true,"TOR Kinase and ABA Receptor",100,29290610,XCorr,4.4256892,1.0000000,,,,0.00033489998895675,
DLTAVGSPENAPAK,ph,S,16,true,"Lateral root-induction - NAA vs control",106,23328941,"MASCOT Score",42.0000000,,-0.1334389,0.4776402,NO,,
DLTAVGSPENAPAK,ph,S,16,true,"Phospho cell culture sucrose/TOR",109,30833711,,,1.0000000,,,,,
DLTAVGSPENAPAK,ph,S,16,true,"Col-0 callus - FC Col-0 vs. Col-0 Xray",111a,31410901,,67.6300000,,0.1928656,0.0000000,NO,,1.1118484
DLTAVGSPENAPAK,ph,S,16,true,"Col-0 X-ray callus - FC Col-0 vs. Col-0 Xray",111b,31410901,,67.6300000,,0.1928656,0.0000000,NO,,1.1118484
DLTAVGSPENAPAK,ph,S,16,true,"atm callus - FC atm vs. atm Xray",111c,31410901,,67.6300000,,-0.1977694,0.0000000,NO,,1.1118484
DLTAVGSPENAPAK,ph,S,16,true,"atm-3 X-ray callus - FC atm vs. atm Xray",111d,31410901,,67.6300000,,-0.1977694,0.0000000,NO,,1.1118484
DLTAVGSPENAPAK,ph,S,16,true,"Tissue atlas Arabidopsis - ProteomicsDB",114,32188942,"MaxQuant score",275.2300000,1.0000000,,,,0,
DLTAVGSPENAPAKGR,ub,K,23,true,"Arabidopsis ubiquitination COFRADIC",40,26744219,"MaxQuant Score",107.3500000,1.0000000,,,,2.4480000273272E-21,-0.4280000
DLTAVGSPENAPAKGR,ub,K,23,true,"Ubiquitination Membrane Proteins",120,33585938,,,,,,,,
DLTAVGSPENAPAKGR,ub,K,23,true,"upl3 mutant / wildtype",168,35926874,"MaxQuant score",136.3300000,1.0000000,1.0229004,0.0059609,YES,3.3149601119664E-11,1.3433000
GRASVYSEVQSSR,ph,S,27,true,"TOR Kinase and ABA Receptor",100,29290610,XCorr,2.4075999,0.8992000,,,,0.0063869999721646,
GRASVYSEVQSSR,ph,S,27,true,"Tissue atlas Arabidopsis - ProteomicsDB",114,32188942,"MaxQuant score",78.0780000,0.9975600,,,,0.00030842900741845,
NQGGFDMICSGR,acy,C,166,false,"Arabidopsis S-acylation atlas - Meristem",163a,35681017,,,,,,,,
NQGGFDMICSGR,ox,C,166,false,"OxiTRAQ Arabidopsis - 5 mM H2O2 versus control",47,24376095,,,,0.0471296,0.5119504,NO,,
NQGGFDMICSGR,sno,C,166,false,"Site-specific nitrosomeproteomic id - gsnor1-3",90a,25699590,XCorr,2.9713571,,,,,4.3979998736177E-5,-6.6234961
NQGGFDMICSGR,sno,C,166,false,"Site-specific nitrosomeproteomic id - gsnor1-3",90b,25699590,XCorr,2.7500000,,,,,0.048129998147488,-6.0600000
NQGGFDMICSGR,sno,C,166,false,"hot5-4 / wildtype, FAT-switch S-nitrosoproteome",169,37277371,,,,,,,,
NQGGFDMICSGR,so,C,166,false,"Arabidopsis S-sulfenylation chemoproteomics",108,31578252,"pFind PSM Score",0.0011816,,1.1508200,,,,-1.7920119
NQGGFDMICSGR,so,C,166,false,"S-sulfenylation site detection using YAP1C",110,32714340,,,,,,,,
LLAENFR,nt,L,207,true,"Arg/N-end rule seed, prt6 vs. Wt",99,29168982,"MASCOT Score",32.6800000,,-0.7108039,0.0396085,NO,0.21220000088215,0.1645690
VIGCPK,ox,C,224,false,"OxiTRAQ Arabidopsis - 5 mM H2O2 versus control",47,24376095,,,,0.0115244,0.4302517,NO,,
VIGCPK,sno,C,224,false,"hot5-4 / wildtype, FAT-switch S-nitrosoproteome",169,37277371,,,,,,,,
TIDGDLKCK,so,C,234,true,"Arabidopsis S-sulfenylation chemoproteomics",108,31578252,"pFind PSM Score",0.2793000,,0.9523800,,,,0.2665458
EVPTSFGFDTACK,sno,C,247,false,"hot5-4 / wildtype, FAT-switch S-nitrosoproteome",169,37277371,,,,,,,,
STGKYYHFVR,nt,S,263,false,"Arabidopsis translation initiation landscape - NT",167b,35069635,,,,,,,,
NVTDYMVDVICK,so,C,319,true,"Arabidopsis S-sulfenylation chemoproteomics",108,31578252,"pFind PSM Score",0.0078379,,,,,,-1.9556452
NVTDYMVDVICK,so,C,319,true,"S-sulfenylation site detection using YAP1C",110,32714340,,,,,,,,
EEWALKNR,ac,K,536,false,"Quantitative Acetylproteomics",101,29440448,,,,,,,,
