Peptide,PTM,ModifiedAA,ModifiedPosition,PeptideUniqueToGene,ExperimentDesc,ExpID,PubmedID,ScoreType,IdentScore,LocProb,Log2FChange,PQ-val,QuantSig,PEP,MassErrorPPM
MNEEEPDKEHVADSTMSAAAIDGVAALR,nta,M,1,true,"Arg/N-end rule seed, prt6 vs. Wt",99,29168982,"MASCOT Score",33.4100000,,-0.4333682,0.3917031,NO,0.11410000175238,-1.5672755
MNEEEPDKEHVADSTMSAAAIDGVAALR,nta,M,1,true,"HUNTER N-terminome: legumain, GluC and trypsin",119,31951383,"MaxQuant score",44.0500000,,,,,,
MNEEEPDKEHVADSTMSAAAIDGVAALR,nta,M,1,true,"Arabidopsis translation initiation landscape - NTA",167a,35069635,,,,,,,,
ADSTMSAAAIDGVAALR,nta,A,12,true,"FtsH12 N-terminome: WT / FtsH12 knockdown miRNA",118,33216923,"MaxQuant score",58.6740000,,,,,1.6600000890321E-5,
ADSTMSAAAIDGVAALR,nta,A,12,true,"Arabidopsis translation initiation landscape - NTA",167a,35069635,,,,,,,,
SAAAIDGVAALR,nt,S,17,true,"Stromal N-terminome",96,26371235,"MASCOT Score",71.1000000,,,,,,
SAAAIDGVAALR,nt,S,17,true,"Arg/N-end rule seed, prt6 vs. Wt",99,29168982,"MASCOT Score",70.0300000,,,,,0.004939999897033,-0.8517717
SAAAIDGVAALRSVFQRVNQAAE,nta,S,17,true,"Arabidopsis translation initiation landscape - NTA",167a,35069635,,,,,,,,
SAAAIDGVAALR,nta,S,17,true,"Characterization plant N-terminal acetylation",6,22223895,"MASCOT Score",89.6500000,,,,,,
SAAAIDGVAALR,nta,S,17,true,"Arg/N-end rule pathway Roots",80,25728785,"MASCOT Score",76.9100000,,,,,1.3150000086171E-5,
SAAAIDGVAALR,nta,S,17,true,"Stromal N-terminome",96,26371235,"MASCOT Score",71.1000000,,,,,,
SAAAIDGVAALR,nta,S,17,true,"Arg/N-end rule seed, prt6 vs. Wt",99,29168982,"MASCOT Score",70.0300000,,,,,0.004939999897033,-0.8517717
SAAAIDGVAALR,nta,S,17,true,"FtsH12 N-terminome: WT / FtsH12 knockdown miRNA",118,33216923,"MaxQuant score",65.3470000,,,,,0.032370999455452,
SAAAIDGVAALR,nta,S,17,true,"HUNTER N-terminome: legumain, GluC and trypsin",119,31951383,"MaxQuant score",177.7800000,,,,,,
AAAIDGVAALR,nta,A,18,true,"Arabidopsis translation initiation landscape - NTA",167a,35069635,,,,,,,,
VNQAAEKAGR,ub,K,40,true,"Arabidopsis ubiquitination COFRADIC",40,26744219,"MaxQuant Score",136.9600000,1.0000000,,,,1.2329999776739E-7,0.0580000
VVAVSKTKPVSLIR,pgk,K,55,true,"Open search Plant PTM Viewer 2.0 - 3pgK",164f,TBA,,,,,,,,
IGSTIFGAR,ph,S,246,true,"atm and atr DNA damage response",88,25561503,"MASCOT Score",37.0000000,0.9980000,,,,,-1.5100000
