Peptide,PTM,ModifiedAA,ModifiedPosition,PeptideUniqueToGene,ExperimentDesc,ExpID,PubmedID,ScoreType,IdentScore,LocProb,Log2FChange,PQ-val,QuantSig,PEP,MassErrorPPM
DSGDADVVVLKNYLDAQYYGE,nt,D,65,true,"N-terminal ChaFRADIC",92,26010716,"MASCOT Score",46.7600000,,,,,1.3400000398178E-6,
DSGDADVVVLKN,nt,D,65,true,"HUNTER N-terminome: legumain, GluC and trypsin",119,31951383,"MaxQuant score",221.5200000,,,,,,
DSGDADVVVL,nt,D,65,true,"N-terminal ChaFRADIC",92,26010716,"MASCOT Score",82.3700000,,,,,2.3180000425782E-5,
SGDADVVVLKNYLDAQYYGE,nt,S,66,true,"N-terminal ChaFRADIC",92,26010716,"MASCOT Score",22.6300000,,,,,1.3540000232126E-8,
SGDADVVVLKNYLD,nt,S,66,true,"HUNTER N-terminome: legumain, GluC and trypsin",119,31951383,"MaxQuant score",131.3700000,,,,,,
SGDADVVVL,nt,S,66,true,"N-terminal ChaFRADIC",92,26010716,"MASCOT Score",29.6800000,,,,,0.014940000139177,
GKHTYVPVTQK,ac,K,249,true,"Quantitative Acetylproteomics",101,29440448,,,,,,,,
DAACSACEMAVVWIQSQLR,nt,D,377,true,"FtsH12 N-terminome: WT / FtsH12 knockdown miRNA",118,33216923,"MaxQuant score",88.4410000,,-0.0222526,0.8738820,NO,6.7399996623863E-5,
DAACSACEMAVVWIQSQLR,nt,D,377,true,"HUNTER N-terminome: legumain, GluC and trypsin",119,31951383,"MaxQuant score",91.3710000,,,,,,
DAACSACE,nt,D,377,true,"Arg/N-end rule seed, prt6 vs. Wt",99,29168982,"MASCOT Score",44.5400000,,0.1945743,0.2926194,NO,0.021279999986291,1.7398232
ILNYVNELCER,ox,C,411,true,"Bicarbonate Induced Redox Changes - 5 min",117a,28184230,,,,0.6040713,,YES,,
LPSPMGESAVDCAQLSTMPTVSLTIGGK,sno,C,425,true,"hot5-4 / wildtype, FAT-switch S-nitrosoproteome",169,37277371,,,,0.2045545,0.3887995,NO,,
VGEGPVAQCISGFIALDVAPPR,ox,C,462,true,"Bicarbonate Induced Redox Changes - 5 min",117a,28184230,,,,-1.5145732,,YES,,
