Peptide,PTM,ModifiedAA,ModifiedPosition,PeptideUniqueToGene,ExperimentDesc,ExpID,PubmedID,ScoreType,IdentScore,LocProb,Log2FChange,PQ-val,QuantSig,PEP,MassErrorPPM
AEASDLLEWPKKDNR,nt,A,2,true,"Stromal N-terminome",96,26371235,"MASCOT Score",35.4500000,,,,,,
AEASDLLEWPKKDNR,nt,A,2,true,"Arg/N-end rule seed, prt6 vs. Wt",99,29168982,"MASCOT Score",33.8200000,,,,,0.0016580000519753,-2.5520343
AEASDLLEWP,nt,A,2,true,"N-term acetylation drought responses",5,26184543,,,,,,,,
AEASDLLEWPKKDNRRF,nta,A,2,true,"Arabidopsis translation initiation landscape - NTA",167a,35069635,,,,,,,,
AEASDLLEWPKKDNRR,nta,A,2,true,"Arg/N-end rule pathway Roots",80,25728785,"MASCOT Score",32.3000000,,,,,0.0073549998924136,
AEASDLLEWPKKDNRR,nta,A,2,true,"HUNTER N-terminome: legumain, GluC and trypsin",119,31951383,"MaxQuant score",71.0800000,,,,,,
AEASDLLEWPKKDNR,nta,A,2,true,"Arg/N-end rule pathway Roots",80,25728785,"MASCOT Score",32.8000000,,,,,0.032480001449585,
AEASDLLEWPKKDNR,nta,A,2,true,"Stromal N-terminome",96,26371235,"MASCOT Score",35.4500000,,,,,,
AEASDLLEWPKKDNR,nta,A,2,true,"Arg/N-end rule seed, prt6 vs. Wt",99,29168982,"MASCOT Score",33.8200000,,0.0040913,0.9616856,NO,0.0016580000519753,-2.5520343
AEASDLLEWPKKDNR,nta,A,2,true,"HUNTER N-terminome: legumain, GluC and trypsin",119,31951383,"MaxQuant score",79.6520000,,,,,,
AEASDLLEWPKKDN,nta,A,2,true,"HUNTER N-terminome: legumain, GluC and trypsin",119,31951383,"MaxQuant score",131.8200000,,,,,,
AEASDLLEWPKKD,nta,A,2,true,"HUNTER N-terminome: legumain, GluC and trypsin",119,31951383,"MaxQuant score",54.4710000,,,,,,
AEASDLLEWPK,nta,A,2,true,"Characterization plant N-terminal acetylation",6,22223895,"MASCOT Score",83.6700000,,,,,,
AEASDLLEWP,nta,A,2,true,"N-term acetylation drought responses",5,26184543,,,,,,,,
DVSKLVENVR,nt,D,96,true,"Arg/N-end rule seed, prt6 vs. Wt",99,29168982,"MASCOT Score",23.5400000,,-0.7885357,0.0405867,NO,0.028160000219941,0.5480340
EPGPVKGGGSVIAFVK,ub,K,119,true,"upl3 mutant / wildtype",168,35926874,"MaxQuant score",62.0550000,1.0000000,-0.3864683,,,0.00025351598742418,1.3001000
GGGSVIAFVK,ph,S,123,true,"Tissue atlas Arabidopsis - ProteomicsDB",114,32188942,"MaxQuant score",113.6900000,1.0000000,,,,0.00019569300638977,
GPTPEPFCQVMLR,acy,C,149,true,"Arabidopsis S-acylation atlas - Hypocotyl",163b,35681017,,,,,,,,
GPTPEPFCQVMLR,acy,C,149,true,"Arabidopsis S-acylation atlas - Silique",163e,35681017,,,,,,,,
GPTPEPFCQVMLR,so,C,149,true,"S-sulfenylation site detection using YAP1C",110,32714340,,,,,,,,
AIKFYEK,ac,K,163,false,"Quantitative Acetylproteomics",101,29440448,,,,,,,,
SGEVIKIVNQELGGKITR,nt,S,230,true,"Arabidopsis translation initiation landscape - NT",167b,35069635,,,,,,,,
SGEVIKIVNQE,nt,S,230,true,"HUNTER N-terminome: legumain, GluC and trypsin",119,31951383,"MaxQuant score",88.1810000,,,,,,
SGEVIKIVNQELGGK,cr,K,235,true,"Open search Plant PTM Viewer 2.0 - Crotonylation",164c,TBA,,,,,,,,
IVNQELGGKITR,ac,K,244,true,"Quantitative Acetylproteomics",101,29440448,,,,,,,,
IVNQELGGKITR,ub,K,244,true,"upl3 mutant / wildtype",168,35926874,"MaxQuant score",149.2300000,1.0000000,-0.9742624,0.3683400,NO,3.9987899103089E-10,0.8532600
