Peptide,PTM,ModifiedAA,ModifiedPosition,PeptideUniqueToGene,ExperimentDesc,ExpID,PubmedID,ScoreType,IdentScore,LocProb,Log2FChange,PQ-val,QuantSig,PEP,MassErrorPPM
LTMSQSER,ph,S,10,true,"Tissue atlas Arabidopsis - ProteomicsDB",114,32188942,"MaxQuant score",90.4340000,0.7611180,,,,0.001761749968864,
KLTMSQSER,ph,S,12,true,"atm and atr DNA damage response",88,25561503,"MASCOT Score",47.0000000,1.0000000,,,,,-1.5700000
LTMSQSER,ph,S,12,true,"TOR Kinase and ABA Receptor",100,29290610,XCorr,2.4960258,0.9903000,,,,0.0011320000048727,
LTMSQSER,ph,S,12,true,"Lateral root-induction - NAA vs control",106,23328941,"MASCOT Score",24.0000000,,,,,,
LTMSQSER,ph,S,12,true,"Tissue atlas Arabidopsis - ProteomicsDB",114,32188942,"MaxQuant score",140.4900000,0.9999820,,,,0.00043725300929509,
VGGGLSLAFEDASSSPR,ph,S,76,true,"srk2dei ABA signaling phopshoproteomics",83,23572148,"MASCOT Score",27.0000000,,,,,,0.0021000
VGGGLSLAFEDASSSPR,ph,S,83,true,"Tissue atlas Arabidopsis - ProteomicsDB",114,32188942,"MaxQuant score",241.6800000,0.8550130,,,,0,
VGGGLSLAFEDASSSPR,ph,S,84,true,"srk2dei ABA signaling phopshoproteomics",83,23572148,"MASCOT Score",27.0000000,,,,,,0.0021000
VGGGLSLAFEDASSSPR,ph,S,85,true,"Large-scale phosphorylation discovery",44,23111157,XCorr,5.1260000,,,,,,
VGGGLSLAFEDASSSPR,ph,S,85,true,"srk2dei ABA signaling phopshoproteomics",83,23572148,"MASCOT Score",74.0000000,,,,,,-0.0007000
VGGGLSLAFEDASSSPR,ph,S,85,true,"SnRK2 protein kinase substrates",85,23776212,XCorr,3.2741838,0.9950000,,,,5.1177698878746E-6,
VGGGLSLAFEDASSSPR,ph,S,85,true,"Lateral root-induction - NAA vs control",106,23328941,"MASCOT Score",37.0000000,,,,,,
QLASSAPVNVPDWSK,ph,S,114,true,"srk2dei ABA signaling phopshoproteomics",83,23572148,"MASCOT Score",38.0000000,,,,,,-0.0006000
QLASSAPVNVPDWSK,ph,S,114,true,"Lateral root-induction - NAA vs control",106,23328941,"MASCOT Score",39.0000000,,,,,,
QLASSAPVNVPDWSK,ph,S,115,true,"Large-scale phosphorylation discovery",44,23111157,XCorr,4.1990000,,,,,,
QLASSAPVNVPDWSK,ph,S,115,true,"MAPK Arabidopsis substrates",45,23172892,"MaxQuant Score",85.4930000,,,,,,
QLASSAPVNVPDWSK,ph,S,115,true,"srk2dei ABA signaling phopshoproteomics",83,23572148,"MASCOT Score",61.0000000,,,,,,-0.0007000
QLASSAPVNVPDWSK,ph,S,115,true,"SnRK2 protein kinase substrates",85,23776212,XCorr,2.3040035,0.9940000,,,,5.0380901939207E-7,
QLASSAPVNVPDWSK,ph,S,115,true,"Lateral root-induction - NAA vs control",106,23328941,"MASCOT Score",37.0000000,,,,,,
QLASSAPVNVPDWSK,ph,S,115,true,"Tissue atlas Arabidopsis - ProteomicsDB",114,32188942,"MaxQuant score",173.5100000,0.9381290,,,,4.0577899480781E-29,
LASSAPVNVPDWSK,ph,S,115,false,"Large-scale phosphorylation discovery",44,23111157,XCorr,4.1630000,,,,,,
KSGGGGSVFEGVGR,ph,S,167,true,"atm and atr DNA damage response",88,25561503,"MASCOT Score",59.0000000,1.0000000,,,,,-1.3300000
SGGGGSVFEGVGR,ph,S,167,true,"STN8 phosphoproteome",38,21768351,"MASCOT Score",87.0200000,,,,,,0.0919491
SGGGGSVFEGVGR,ph,S,167,true,"Phosphoproteomic analysis of seed maturation",42,22440515,"MASCOT Score",36.0000000,,,,,,2.4700000
SGGGGSVFEGVGR,ph,S,167,true,"Chloroplast kinase substrates",60,19376835,"MASCOT Score",80.2000000,,,,,,-0.5498310
SGGGGSVFEGVGR,ph,S,167,true,"srk2dei ABA signaling phopshoproteomics",83,23572148,"MASCOT Score",87.0000000,,,,,,0.0002000
SGGGGSVFEGVGR,ph,S,167,true,"LAXIC - mannitol vs control",84b,23660473,XCorr,3.0800000,1.0000000,,,,0.00041881398647092,
SGGGGSVFEGVGR,ph,S,167,true,"SnRK2 protein kinase substrates",85,23776212,XCorr,3.0673287,1.0000000,,,,0.0048793698661029,
SGGGGSVFEGVGR,ph,S,167,true,"atm and atr DNA damage response",88,25561503,"MASCOT Score",68.0000000,1.0000000,,,,,1.2300000
SGGGGSVFEGVGR,ph,S,167,true,"TOR Kinase and ABA Receptor",100,29290610,XCorr,4.3362603,1.0000000,,,,2.162999948041E-7,
SGGGGSVFEGVGR,ph,S,167,true,"Lateral root-induction - NAA vs control",106,23328941,"MASCOT Score",42.0000000,,,,,,
SGGGGSVFEGVGR,ph,S,167,true,"Tissue atlas Arabidopsis - ProteomicsDB",114,32188942,"MaxQuant score",219.3500000,1.0000000,,,,0,
KSGGGGSVFEGVGR,ph,S,172,true,"atm and atr DNA damage response",88,25561503,"MASCOT Score",92.0000000,1.0000000,,,,,-0.3400000
SGGGGSVFEGVGR,ph,S,172,true,"atm and atr DNA damage response",88,25561503,"MASCOT Score",72.0000000,1.0000000,,,,,0.0900000
SGGGGSVFEGVGR,ph,S,172,true,"Lateral root-induction - NAA vs control",106,23328941,"MASCOT Score",28.0000000,,,,,,
SGGGGSVFEGVGR,ph,S,172,true,"Tissue atlas Arabidopsis - ProteomicsDB",114,32188942,"MaxQuant score",211.8200000,1.0000000,,,,1.4401200369805E-39,
