Peptide,PTM,ModifiedAA,ModifiedPosition,PeptideUniqueToGene,ExperimentDesc,ExpID,PubmedID,ScoreType,IdentScore,LocProb,Log2FChange,PQ-val,QuantSig,PEP,MassErrorPPM
MMQQPPPGGILPHHAPPPSAQQQY,nta,M,1,true,"Arabidopsis translation initiation landscape - NTA",167a,35069635,,,,,,,,
MMQQPPPGGILPHH,nta,M,1,true,"Arg/N-end rule seed, prt6 vs. Wt",99,29168982,"MASCOT Score",27.5200000,,,,,0.00028139998903498,-4.9512666
MMQQPPPGGILPH,nta,M,1,true,"Arg/N-end rule seed, prt6 vs. Wt",99,29168982,"MASCOT Score",26.6000000,,,,,0.09341000020504,-4.5888540
MQQPPPGGILPHH,nt,M,2,true,"Arg/N-end rule seed, prt6 vs. Wt",99,29168982,"MASCOT Score",28.9700000,,,,,0.0031010000966489,-1.2101108
MQQPPPGGILPH,nt,M,2,true,"Arg/N-end rule seed, prt6 vs. Wt",99,29168982,"MASCOT Score",26.6700000,,,,,0.14679999649525,-0.3522390
MQQPPPGGILPHH,nta,M,2,true,"Arg/N-end rule seed, prt6 vs. Wt",99,29168982,"MASCOT Score",28.9700000,,,,,0.0031010000966489,-1.2101108
MQQPPPGGILPH,nta,M,2,true,"Arg/N-end rule seed, prt6 vs. Wt",99,29168982,"MASCOT Score",26.6700000,,,,,0.14679999649525,-0.3522390
CGFVQFSEK,sno,C,298,true,"hot5-4 / wildtype, FAT-switch S-nitrosoproteome",169,37277371,,,,0.2317191,0.3276831,NO,,
