Peptide,PTM,ModifiedAA,ModifiedPosition,PeptideUniqueToGene,ExperimentDesc,ExpID,PubmedID,ScoreType,IdentScore,LocProb,Log2FChange,PQ-val,QuantSig,PEP,MassErrorPPM
AATVDSDYSSKRSNSNEQRE,nt,A,59,true,"Arabidopsis translation initiation landscape - NT",167b,35069635,,,,,,,,
AATVDSDYSSKR,nta,A,59,true,"FtsH12 N-terminome: WT / FtsH12 knockdown miRNA",118,33216923,"MaxQuant score",162.2200000,,,,,1.5700000017177E-37,
ATVDSDYSSKRSNSNEQRE,nt,A,60,true,"Arabidopsis translation initiation landscape - NT",167b,35069635,,,,,,,,
TVDSDYSSKRSNSNEQRE,nt,T,61,true,"Arabidopsis translation initiation landscape - NT",167b,35069635,,,,,,,,
TVDSDYSSKRSNSNEQRE,nta,T,61,true,"Arabidopsis translation initiation landscape - NTA",167a,35069635,,,,,,,,
TVLGSMEE,nt,T,117,true,"Arg/N-end rule seed, prt6 vs. Wt",99,29168982,"MASCOT Score",49.7500000,,-0.0993239,0.6090900,NO,0.038600001484156,-0.5915248
YINGEIIPCTYPTYQPK,sno,C,187,true,"Site-specific nitrosomeproteomic id - gsnor1-3",90a,25699590,XCorr,2.4192243,,,,,0.027669999748468,-3.3962784
YINGEIIPCTYPTYQPK,sno,C,187,true,"Site-specific nitrosomeproteomic id - gsnor1-3",90b,25699590,XCorr,3.2000000,,,,,0.070349998772144,-6.3800000
NNTKYQSK,ac,K,201,true,"Histone deacetylases- hda14 vs WT (low light)",98c,29061669,"MaxQuant Score",116.7300000,1.0000000,4.6790000,0.2432204,NO,0.03999999910593,
NNTKYQSKR,ub,K,201,true,"Arabidopsis ubiquitination COFRADIC",40,26744219,"MaxQuant Score",46.0010000,1.0000000,,,,0.0070000002160668,0.4750000
