Peptide,PTM,ModifiedAA,ModifiedPosition,PeptideUniqueToGene,ExperimentDesc,ExpID,PubmedID,ScoreType,IdentScore,LocProb,Log2FChange,PQ-val,QuantSig,PEP,MassErrorPPM
ADQVKERTLE,nt,A,2,true,"N-term acetylation drought responses",5,26184543,,,,,,,,
ADQVKERTLE,nta,A,2,true,"N-term acetylation drought responses",5,26184543,,,,,,,,
VASTMHPCSAAEEAK,sno,C,95,true,"hot5-4 / wildtype, FAT-switch S-nitrosoproteome",169,37277371,,,,,,,,
TIEYQYSNDPER,ph,S,207,true,"Tissue atlas Arabidopsis - ProteomicsDB",114,32188942,"MaxQuant score",125.5300000,0.9999980,,,,3.6115601687925E-5,
DTSFGRR,ph,S,220,false,"Tissue atlas Arabidopsis - ProteomicsDB",114,32188942,"MaxQuant score",77.7320000,0.9987020,,,,0.018793800845742,
HSGSNTPFSSR,ph,S,473,true,"atm and atr DNA damage response",88,25561503,"MASCOT Score",49.0000000,1.0000000,,,,,0.0400000
HSGSNTPFSSR,ph,S,473,true,"Tissue atlas Arabidopsis - ProteomicsDB",114,32188942,"MaxQuant score",86.4050000,0.9443880,,,,0.00063333800062537,
HSGSNTPFSSR,ph,T,477,true,"atm and atr DNA damage response",88,25561503,"MASCOT Score",33.0000000,1.0000000,,,,,0.1100000
PTTPTHGSSPIHLLHNFNNR,ph,T,485,true,"Tissue atlas Arabidopsis - ProteomicsDB",114,32188942,"MaxQuant score",166.8900000,0.8057140,,,,0,
HSGSNTPFSSRPTTPTHGSSPIHLLHNFNNR,ph,S,491,true,"Tissue atlas Arabidopsis - ProteomicsDB",114,32188942,"MaxQuant score",90.0360000,0.7608000,,,,1.2505600223527E-17,
SVENYPSSPSPR,ph,S,509,true,"Lateral root-induction - NAA vs control",106,23328941,"MASCOT Score",39.0000000,,,,,,
SVENYPSSPSPR,ph,S,509,true,"Tissue atlas Arabidopsis - ProteomicsDB",114,32188942,"MaxQuant score",193.1500000,0.8540830,,,,2.3778300972345E-24,
SVENYPSSPSPR,ph,S,510,true,"Large-scale phosphorylation discovery",44,23111157,XCorr,3.3840000,,,,,,
SVENYPSSPSPR,ph,S,510,true,"Chloroplast kinase substrates",60,19376835,"MASCOT Score",32.1700000,,,,,,-0.7425440
SVENYPSSPSPR,ph,S,510,true,"atm and atr DNA damage response",88,25561503,"MASCOT Score",49.0000000,0.9980000,,,,,0.1600000
SVENYPSSPSPR,ph,S,510,true,"Protein sumoylation and phosphorylation cross-talk",97,28419593,,,,,,,,
SVENYPSSPSPR,ph,S,510,true,"Lateral root-induction - NAA vs control",106,23328941,"MASCOT Score",44.0000000,,,,,,
SVENYPSSPSPR,ph,S,510,true,"Tissue atlas Arabidopsis - ProteomicsDB",114,32188942,"MaxQuant score",212.1100000,0.9892490,,,,9.3096302011324E-32,
SVENYPSSPSPR,ph,S,512,true,"Phosphorylation Early Elicitor Signaling",23,17317660,,,,,,,,
SVENYPSSPSPR,ph,S,512,true,"Large-scale phosphorylation discovery",44,23111157,XCorr,4.0490000,,,,,,
SVENYPSSPSPR,ph,S,512,true,"Phosphoproteome ethylene-regulated time response",46,24043427,"MASCOT Score",43.9600000,,,,,,3.7537000
SVENYPSSPSPR,ph,S,512,true,"Chloroplast kinase substrates",60,19376835,"MASCOT Score",48.1100000,,,,,,-0.0359721
SVENYPSSPSPR,ph,S,512,true,"Conserved plant phosphoproteome - Arabidopsis",61a,20466843,"MASCOT Score",30.0000000,1.0000000,,,,,
SVENYPSSPSPR,ph,S,512,true,"srk2dei ABA signaling phopshoproteomics",83,23572148,"MASCOT Score",57.0000000,,,,,,0.0005000
SVENYPSSPSPR,ph,S,512,true,"LAXIC - ABA stress",84a,23660473,XCorr,2.4100000,1.0000000,,,,0.011572199873626,
SVENYPSSPSPR,ph,S,512,true,"SnRK2 protein kinase substrates",85,23776212,XCorr,2.9026842,0.9990000,,,,0.063389502465725,
SVENYPSSPSPR,ph,S,512,true,"SIRK1 phosphorylation",86a,23820729,"MaxQuant Score",103.3300000,0.9990000,,,,0.086000002920628,3.8720000
SVENYPSSPSPR,ph,S,512,true,"SIRK1 exp - sirk1 mutant vs WT",86b,23820729,,,,2.1788631,,NO,,
SVENYPSSPSPR,ph,S,512,true,"atm and atr DNA damage response",88,25561503,"MASCOT Score",49.0000000,1.0000000,,,,,0.1600000
SVENYPSSPSPR,ph,S,512,true,"Protein sumoylation and phosphorylation cross-talk",97,28419593,,,,,,,,
SVENYPSSPSPR,ph,S,512,true,"TOR Kinase and ABA Receptor",100,29290610,XCorr,3.8038468,0.9955000,,,,5.8290002016292E-6,
SVENYPSSPSPR,ph,S,512,true,"Lateral root-induction - NAA vs control",106,23328941,"MASCOT Score",44.0000000,,,,,,
SVENYPSSPSPR,ph,S,512,true,"Tissue atlas Arabidopsis - ProteomicsDB",114,32188942,"MaxQuant score",214.4800000,0.9985000,,,,7.0095905925287E-39,
SSEPVLASVE,nt,S,547,true,"N-terminal ChaFRADIC",92,26010716,"MASCOT Score",40.0200000,,,,,0.0021699999924749,
SLRDFSFKK,ph,S,570,true,"srk2dei ABA signaling phopshoproteomics",83,23572148,"MASCOT Score",30.0000000,,,,,,0.0003000
SLRDFSFKK,ph,S,570,true,"Tissue atlas Arabidopsis - ProteomicsDB",114,32188942,"MaxQuant score",94.7670000,1.0000000,,,,0.0020931400358677,
DFSFK,ph,S,570,false,"srk2dei ABA signaling phopshoproteomics",83,23572148,"MASCOT Score",23.0000000,,,,,,0.0008000
