Peptide,PTM,ModifiedAA,ModifiedPosition,PeptideUniqueToGene,ExperimentDesc,ExpID,PubmedID,ScoreType,IdentScore,LocProb,Log2FChange,PQ-val,QuantSig,PEP,MassErrorPPM
TGGLHNEEAGSLATPTSAR,nt,T,2,true,"Arg/N-end rule pathway Roots",80,25728785,"MASCOT Score",56.3800000,,,,,0.001086000003852,
TGGLHNEEAGSLATPTSAR,nt,T,2,true,"Arg/N-end rule seed, prt6 vs. Wt",99,29168982,"MASCOT Score",49.5800000,,0.0294750,0.8913160,NO,0.0019280000124127,-1.7971079
TGGLHNEEAGSLATPTSAR,nt,T,2,true,"HUNTER N-terminome: legumain, GluC and trypsin",119,31951383,"MaxQuant score",87.3520000,,,,,,
TGGLHNEEAGSLATPTSAR,nta,T,2,true,"FtsH12 N-terminome: WT / FtsH12 knockdown miRNA",118,33216923,"MaxQuant score",105.4600000,,,,,3.3000000509986E-9,
TGGLHNEEAGSLATPTSAR,ph,T,15,true,"Tissue atlas Arabidopsis - ProteomicsDB",114,32188942,"MaxQuant score",180.0300000,0.9997480,,,,0,
SLTVSFDEK,ph,S,35,true,"Tissue atlas Arabidopsis - ProteomicsDB",114,32188942,"MaxQuant score",108.7000000,0.9996040,,,,0.00055869197240099,
KEAQKQQEEAFR,ub,K,57,true,"Arabidopsis ubiquitination COFRADIC",40,26744219,"MaxQuant Score",85.8370000,1.0000000,,,,9.8199998319615E-5,0.1120000
KEAQKQQEEAFR,ub,K,61,true,"Arabidopsis ubiquitination COFRADIC",40,26744219,"MaxQuant Score",135.0200000,1.0000000,,,,2.2969999452931E-26,0.1470000
TQSTESGSTAKASTKQPVPVR,ph,T,147,true,"Large-scale phosphorylation discovery",44,23111157,XCorr,3.0190000,,,,,,
TQSTESGSTAKASTKQPVPVR,ph,S,149,true,"Large-scale phosphorylation discovery",44,23111157,XCorr,3.0190000,,,,,,
KEKTQSTESGSTAKASTKQPVPVR,ub,K,157,true,"Arabidopsis ubiquitination COFRADIC",40,26744219,"MaxQuant Score",82.1770000,0.9850000,,,,5.4789999060315E-27,-0.2780000
KTKPMKQSR,ub,K,170,true,"Arabidopsis ubiquitination COFRADIC",40,26744219,"MaxQuant Score",42.8020000,0.9730000,,,,0.019999999552965,-0.2540000
STTKTMKKR,ub,K,185,true,"Arabidopsis ubiquitination COFRADIC",40,26744219,"MaxQuant Score",52.5790000,0.7700000,,,,0.0089999996125698,0.1470000
DKKKQAR,ub,K,189,true,"Arabidopsis ubiquitination COFRADIC",40,26744219,"MaxQuant Score",103.8300000,1.0000000,,,,0.003000000026077,-1.7290000
DKKKQAR,ub,K,190,true,"Arabidopsis ubiquitination COFRADIC",40,26744219,"MaxQuant Score",103.8300000,0.8810000,,,,0.003000000026077,0.0220000
